Ошибка компиляции это что

Ошибка компиляции относится к состоянию, когда компилятору не удается скомпилировать часть исходного кода компьютерной программы либо из-за ошибок в коде, либо, что более необычно, из-за ошибок в самом компиляторе. Сообщение об ошибке компиляции часто помогает программистам отлаживать исходный код. Хотя определения компиляции и интерпретации могут быть расплывчатыми, обычно ошибки компиляции относятся только к статической компиляции, а не к динамической компиляции . Однако важно отметить, что динамическая компиляция все еще может технически иметь ошибки компиляции, [ необходима ссылка ] хотя многие программисты и источники могут идентифицировать их как ошибки времени выполнения. Большинство оперативных компиляторов , таких как механизм Javascript V8 , неоднозначно называют ошибки компиляции синтаксическими ошибками, поскольку они проверяют их во время выполнения . [1] [2]

Ошибка компиляции

Из Википедии, бесплатной энциклопедии

Перейти к навигации
Перейти к поиску

Ошибка компиляции относится к состоянию, когда компилятору не удается скомпилировать часть исходного кода компьютерной программы либо из-за ошибок в коде, либо, что более необычно, из-за ошибок в самом компиляторе. Сообщение об ошибке компиляции часто помогает программистам отлаживать исходный код. Хотя определения компиляции и интерпретации могут быть расплывчатыми, обычно ошибки компиляции относятся только к статической компиляции, а не к динамической компиляции . Однако важно отметить, что динамическая компиляция все еще может технически иметь ошибки компиляции, [ необходима ссылка ] хотя многие программисты и источники могут идентифицировать их как ошибки времени выполнения. Большинство оперативных компиляторов , таких как механизм Javascript V8 , неоднозначно называют ошибки компиляции синтаксическими ошибками, поскольку они проверяют их во время выполнения . [1] [2]

Примеры

Common C ++ ошибки компиляции

  • Необъявленный идентификатор, например:

doy.cpp: In function `int main()':
doy.cpp:25: `DayOfYear' undeclared (first use this function)
[3]

Это означает, что переменная DayOfYear пытается использоваться перед объявлением.

  • Общая функция необъявлена, например:

xyz.cpp: In function `int main()': xyz.cpp:6: `cout' undeclared (first use this function)[3]

Это означает, что программист, скорее всего, забыл включить iostream .

  • Ошибка синтаксического анализа, например:

somefile.cpp:24: parse error before `something'[4]

Это может означать, что в конце предыдущего оператора отсутствует точка с запятой.

Внутренние ошибки компилятора

Внутренняя ошибка компилятора (обычно сокращенно ICE) — это ошибка, которая возникает не из-за ошибочного исходного кода, а из-за ошибки в самом компиляторе. Иногда их можно обойти, внося небольшие незначительные изменения в исходный код вокруг строки, указанной ошибкой (если такая строка вообще указана), [5] [ необходим лучший источник ], но иногда необходимо внести более крупные изменения, например, рефакторингкод, чтобы избежать определенных конструкций. Использование другого компилятора или другой версии компилятора может решить проблему и в некоторых случаях быть приемлемым решением. Когда достигается внутренняя ошибка компилятора, многие компиляторы не выводят стандартную ошибку, а вместо этого выводят сокращенную версию с прикрепленными дополнительными файлами, которые предоставляются только для внутренних ошибок компилятора. Это сделано для того, чтобы гарантировать, что программа не выйдет из строя при регистрации ошибки, что сделало бы ее решение практически невозможным. Дополнительные файлы, прикрепленные к внутренним ошибкам компилятора, обычно имеют специальные форматы, в которых они сохраняются, например, .dumpдля Java . Эти форматы, как правило, труднее анализировать, чем обычные файлы, но все же могут содержать очень полезную информацию для решения ошибки, вызывающей сбой.[6]

Пример внутренней ошибки компилятора:

somefile.c: 1001: внутренняя ошибка компилятора: ошибка сегментации
Пожалуйста, отправьте полный отчет об ошибке,
с предварительно обработанным исходным кодом, если необходимо.
См. <Http://bugs.gentoo.org/> для инструкций.

Ссылки

  1. ^ «Ошибки | Документация по Node.js v7.9.0» . nodejs.org . Проверено 14 апреля 2017 .
  2. ^ «SyntaxError» . Сеть разработчиков Mozilla . Проверено 14 апреля 2017 .
  3. ^ a b «Распространенные ошибки компилятора и компоновщика C ++» . Архивировано из оригинала на 2008-02-16 . Проверено 12 февраля 2008 .
  4. ^ «Ошибки компилятора, компоновщика и времени выполнения» .
  5. Каннингем, Уорд (18 марта 2010 г.). «Ошибка компилятора» . WikiWikiWeb . Проверено 14 апреля 2017 .
  6. ^ జగదేశ్. «Анализ сбоя JVM» . Проверено 15 апреля 2017 .

Error is an illegal operation performed by the user which results in the abnormal working of the program. Programming errors often remain undetected until the program is compiled or executed. Some of the errors inhibit the program from getting compiled or executed. Thus errors should be removed before compiling and executing. 

The most common errors can be broadly classified as follows:

1. Run Time Error: 

Run Time errors occur or we can say, are detected during the execution of the program. Sometimes these are discovered when the user enters an invalid data or data which is not relevant. Runtime errors occur when a program does not contain any syntax errors but asks the computer to do something that the computer is unable to reliably do. During compilation, the compiler has no technique to detect these kinds of errors. It is the JVM (Java Virtual Machine) that detects it while the program is running. To handle the error during the run time we can put our error code inside the try block and catch the error inside the catch block. 

For example: if the user inputs a data of string format when the computer is expecting an integer, there will be a runtime error. Example 1: Runtime Error caused by dividing by zero 

Java

class DivByZero {

    public static void main(String args[])

    {

        int var1 = 15;

        int var2 = 5;

        int var3 = 0;

        int ans1 = var1 / var2;

        int ans2 = var1 / var3;

        System.out.println(

            "Division of va1"

            + " by var2 is: "

            + ans1);

        System.out.println(

            "Division of va1"

            + " by var3 is: "

            + ans2);

    }

}

Runtime Error in java code:

Exception in thread "main" java.lang.ArithmeticException: / by zero
    at DivByZero.main(File.java:14)

Example 2: Runtime Error caused by Assigning/Retrieving Value from an array using an index which is greater than the size of the array 

Java

class RTErrorDemo {

    public static void main(String args[])

    {

        int arr[] = new int[5];

        arr[9] = 250;

        System.out.println("Value assigned! ");

    }

}

RunTime Error in java code:

Exception in thread "main" java.lang.ArrayIndexOutOfBoundsException: 9
    at RTErrorDemo.main(File.java:10)

2. Compile Time Error: 

Compile Time Errors are those errors which prevent the code from running because of an incorrect syntax such as a missing semicolon at the end of a statement or a missing bracket, class not found, etc. These errors are detected by the java compiler and an error message is displayed on the screen while compiling. Compile Time Errors are sometimes also referred to as Syntax errors. These kind of errors are easy to spot and rectify because the java compiler finds them for you. The compiler will tell you which piece of code in the program got in trouble and its best guess as to what you did wrong. Usually, the compiler indicates the exact line where the error is, or sometimes the line just before it, however, if the problem is with incorrectly nested braces, the actual error may be at the beginning of the block. In effect, syntax errors represent grammatical errors in the use of the programming language. 

Example 1: Misspelled variable name or method names 

Java

class MisspelledVar {

    public static void main(String args[])

    {

        int a = 40, b = 60;

        int Sum = a + b;

        System.out.println(

            "Sum of variables is "

            + sum);

    }

}

Compilation Error in java code:

prog.java:14: error: cannot find symbol
            + sum);
              ^
  symbol:   variable sum
  location: class MisspelledVar
1 error

Example 2: Missing semicolons 

Java

class PrintingSentence {

    public static void main(String args[])

    {

        String s = "GeeksforGeeks";

        System.out.println("Welcome to " + s)

    }

}

Compilation Error in java code:

prog.java:8: error: ';' expected
        System.out.println("Welcome to " + s)
                                             ^
1 error

Example: Missing parenthesis, square brackets, or curly braces 

Java

class MissingParenthesis {

    public static void main(String args[])

    {

        System.out.println("Printing 1 to 5 n");

        int i;

        for (i = 1; i <= 5; i++ {

            System.out.println(i + "n");

        }

    }

}

Compilation Error in java code:

prog.java:10: error: ')' expected
        for (i = 1; i <= 5; i++ {
                               ^
1 error

Example: Incorrect format of selection statements or loops 

Java

class IncorrectLoop {

    public static void main(String args[])

    {

        System.out.println("Multiplication Table of 7");

        int a = 7, ans;

        int i;

        for (i = 1, i <= 10; i++) {

            ans = a * i;

            System.out.println(ans + "n");

        }

    }

}

Compilation Error in java code:

prog.java:12: error: not a statement
        for (i = 1, i <= 10; i++) {
                      ^
prog.java:12: error: ';' expected
        for (i = 1, i <= 10; i++) {
                                ^
2 errors

Logical Error: A logic error is when your program compiles and executes, but does the wrong thing or returns an incorrect result or no output when it should be returning an output. These errors are detected neither by the compiler nor by JVM. The Java system has no idea what your program is supposed to do, so it provides no additional information to help you find the error. Logical errors are also called Semantic Errors. These errors are caused due to an incorrect idea or concept used by a programmer while coding. Syntax errors are grammatical errors whereas, logical errors are errors arising out of an incorrect meaning. For example, if a programmer accidentally adds two variables when he or she meant to divide them, the program will give no error and will execute successfully but with an incorrect result. 

Example: Accidentally using an incorrect operator on the variables to perform an operation (Using ‘/’ operator to get the modulus instead using ‘%’) 

Java

public class LErrorDemo {

    public static void main(String[] args)

    {

        int num = 789;

        int reversednum = 0;

        int remainder;

        while (num != 0) {

            remainder = num / 10;

            reversednum

                = reversednum * 10

                  + remainder;

            num /= 10;

        }

        System.out.println("Reversed number is "

                           + reversednum);

    }

}

Output:

Reversed number is 7870

Example: Displaying the wrong message 

Java

class IncorrectMessage {

    public static void main(String args[])

    {

        int a = 2, b = 8, c = 6;

        System.out.println(

            "Finding the largest number n");

        if (a > b && a > c)

            System.out.println(

                a + " is the largest Number");

        else if (b > a && b > c)

            System.out.println(

                b + " is the smallest Number");

        else

            System.out.println(

                c + " is the largest Number");

    }

}

Output:

Finding the largest number 

8 is the smallest Number

Syntax Error:

Syntax and Logical errors are faced by Programmers.

Spelling or grammatical mistakes are syntax errors, for example, using an uninitialized variable, using an undefined variable, etc., missing a semicolon, etc.

int x, y;
x = 10 // missing semicolon (;)
z = x + y; // z is undefined, y in uninitialized.

Syntax errors can be removed with the help of the compiler.

Error is an illegal operation performed by the user which results in the abnormal working of the program. Programming errors often remain undetected until the program is compiled or executed. Some of the errors inhibit the program from getting compiled or executed. Thus errors should be removed before compiling and executing. 

The most common errors can be broadly classified as follows:

1. Run Time Error: 

Run Time errors occur or we can say, are detected during the execution of the program. Sometimes these are discovered when the user enters an invalid data or data which is not relevant. Runtime errors occur when a program does not contain any syntax errors but asks the computer to do something that the computer is unable to reliably do. During compilation, the compiler has no technique to detect these kinds of errors. It is the JVM (Java Virtual Machine) that detects it while the program is running. To handle the error during the run time we can put our error code inside the try block and catch the error inside the catch block. 

For example: if the user inputs a data of string format when the computer is expecting an integer, there will be a runtime error. Example 1: Runtime Error caused by dividing by zero 

Java

class DivByZero {

    public static void main(String args[])

    {

        int var1 = 15;

        int var2 = 5;

        int var3 = 0;

        int ans1 = var1 / var2;

        int ans2 = var1 / var3;

        System.out.println(

            "Division of va1"

            + " by var2 is: "

            + ans1);

        System.out.println(

            "Division of va1"

            + " by var3 is: "

            + ans2);

    }

}

Runtime Error in java code:

Exception in thread "main" java.lang.ArithmeticException: / by zero
    at DivByZero.main(File.java:14)

Example 2: Runtime Error caused by Assigning/Retrieving Value from an array using an index which is greater than the size of the array 

Java

class RTErrorDemo {

    public static void main(String args[])

    {

        int arr[] = new int[5];

        arr[9] = 250;

        System.out.println("Value assigned! ");

    }

}

RunTime Error in java code:

Exception in thread "main" java.lang.ArrayIndexOutOfBoundsException: 9
    at RTErrorDemo.main(File.java:10)

2. Compile Time Error: 

Compile Time Errors are those errors which prevent the code from running because of an incorrect syntax such as a missing semicolon at the end of a statement or a missing bracket, class not found, etc. These errors are detected by the java compiler and an error message is displayed on the screen while compiling. Compile Time Errors are sometimes also referred to as Syntax errors. These kind of errors are easy to spot and rectify because the java compiler finds them for you. The compiler will tell you which piece of code in the program got in trouble and its best guess as to what you did wrong. Usually, the compiler indicates the exact line where the error is, or sometimes the line just before it, however, if the problem is with incorrectly nested braces, the actual error may be at the beginning of the block. In effect, syntax errors represent grammatical errors in the use of the programming language. 

Example 1: Misspelled variable name or method names 

Java

class MisspelledVar {

    public static void main(String args[])

    {

        int a = 40, b = 60;

        int Sum = a + b;

        System.out.println(

            "Sum of variables is "

            + sum);

    }

}

Compilation Error in java code:

prog.java:14: error: cannot find symbol
            + sum);
              ^
  symbol:   variable sum
  location: class MisspelledVar
1 error

Example 2: Missing semicolons 

Java

class PrintingSentence {

    public static void main(String args[])

    {

        String s = "GeeksforGeeks";

        System.out.println("Welcome to " + s)

    }

}

Compilation Error in java code:

prog.java:8: error: ';' expected
        System.out.println("Welcome to " + s)
                                             ^
1 error

Example: Missing parenthesis, square brackets, or curly braces 

Java

class MissingParenthesis {

    public static void main(String args[])

    {

        System.out.println("Printing 1 to 5 n");

        int i;

        for (i = 1; i <= 5; i++ {

            System.out.println(i + "n");

        }

    }

}

Compilation Error in java code:

prog.java:10: error: ')' expected
        for (i = 1; i <= 5; i++ {
                               ^
1 error

Example: Incorrect format of selection statements or loops 

Java

class IncorrectLoop {

    public static void main(String args[])

    {

        System.out.println("Multiplication Table of 7");

        int a = 7, ans;

        int i;

        for (i = 1, i <= 10; i++) {

            ans = a * i;

            System.out.println(ans + "n");

        }

    }

}

Compilation Error in java code:

prog.java:12: error: not a statement
        for (i = 1, i <= 10; i++) {
                      ^
prog.java:12: error: ';' expected
        for (i = 1, i <= 10; i++) {
                                ^
2 errors

Logical Error: A logic error is when your program compiles and executes, but does the wrong thing or returns an incorrect result or no output when it should be returning an output. These errors are detected neither by the compiler nor by JVM. The Java system has no idea what your program is supposed to do, so it provides no additional information to help you find the error. Logical errors are also called Semantic Errors. These errors are caused due to an incorrect idea or concept used by a programmer while coding. Syntax errors are grammatical errors whereas, logical errors are errors arising out of an incorrect meaning. For example, if a programmer accidentally adds two variables when he or she meant to divide them, the program will give no error and will execute successfully but with an incorrect result. 

Example: Accidentally using an incorrect operator on the variables to perform an operation (Using ‘/’ operator to get the modulus instead using ‘%’) 

Java

public class LErrorDemo {

    public static void main(String[] args)

    {

        int num = 789;

        int reversednum = 0;

        int remainder;

        while (num != 0) {

            remainder = num / 10;

            reversednum

                = reversednum * 10

                  + remainder;

            num /= 10;

        }

        System.out.println("Reversed number is "

                           + reversednum);

    }

}

Output:

Reversed number is 7870

Example: Displaying the wrong message 

Java

class IncorrectMessage {

    public static void main(String args[])

    {

        int a = 2, b = 8, c = 6;

        System.out.println(

            "Finding the largest number n");

        if (a > b && a > c)

            System.out.println(

                a + " is the largest Number");

        else if (b > a && b > c)

            System.out.println(

                b + " is the smallest Number");

        else

            System.out.println(

                c + " is the largest Number");

    }

}

Output:

Finding the largest number 

8 is the smallest Number

Syntax Error:

Syntax and Logical errors are faced by Programmers.

Spelling or grammatical mistakes are syntax errors, for example, using an uninitialized variable, using an undefined variable, etc., missing a semicolon, etc.

int x, y;
x = 10 // missing semicolon (;)
z = x + y; // z is undefined, y in uninitialized.

Syntax errors can be removed with the help of the compiler.

В этой главе мы напишем первую программу на C++ и научимся печатать и считывать с клавиатуры строки и числа.

Функция main

Пожалуй, самая простая и короткая программа на C++ — это программа, которая ничего не делает. Она выглядит так:

int main() {
    return 0;
}

Здесь определяется функция с именем main, которая не принимает никаких аргументов (внутри круглых скобок ничего нет) и не выполняет никаких содержательных команд. В каждой программе на C++ должна быть ровно одна функция main — с неё начинается выполнение программы.

У функции указан тип возвращаемого значения int (целое число), и она возвращает 0 — в данном случае это сообщение для операционной системы, что программа выполнилась успешно. И наоборот, ненулевой код возврата означает, что при выполнении возникла ошибка (например, программа получила некорректные входные данные).

Для функции main разрешается не писать завершающий return 0, чем мы и будем пользоваться далее для краткости. Поэтому самую короткую программу можно было бы написать вот так:

int main() {
}

Hello, world!

Соблюдая традиции, напишем простейшую программу на C++ — она выведет приветствие в консоль:

#include <iostream>

int main() {
    std::cout << "Hello, world!n";
    return 0;
}

Разберём её подробнее.

Директива #include <iostream> подключает стандартный библиотечный заголовочный файл для работы с потоками ввода-вывода (input-output streams). Для печати мы используем поток вывода std::cout, где cout расшифровывается как character output, то есть «символьный вывод».

В теле функции main мы передаём в std::cout строку Hello, world! с завершающим переводом строки n. В зависимости от операционной системы n будет преобразован в один или в два управляющих байта с кодами 0A или 0D 0A соответственно.

Инструкции внутри тела функции завершаются точками с запятой.

Компиляция из командной строки

Вы можете запустить эту программу из какой-нибудь IDE. Мы же покажем, как собрать её в консоли Linux с помощью компилятора clang++.

Пусть файл с программой называется hello.cpp. Запустим компилятор:

$ clang++ hello.cpp -o hello

В результате мы получим исполняемый файл с именем hello, который теперь можно просто запустить. Он напечатает на экране ожидаемую фразу:

$ ./hello
Hello, world!

Если опцию -o не указать, то сгенерированный исполняемый файл будет по умолчанию назван a.out. В дальнейшем для простых примеров мы будем использовать краткую форму записи команды:

$ clang++ hello.cpp && ./a.out
Hello, world!

С её помощью мы компилируем программу и в случае успеха компиляции сразу же запускаем.

Комментарии

Комментарии — это фрагменты программы, которые игнорируются компилятором и предназначены для программиста. В C++ есть два вида комментариев — однострочные и многострочные:


int main() {  // однострочный комментарий продолжается до конца строки

/* Пример
   многострочного
   комментария */
}

Мы будем использовать комментарии в примерах кода для пояснений, а в реальных программах ими лучше не злоупотреблять.

Хорошо: комментировать, что делает библиотека, функция или класс или почему этот код написан именно так.

Плохо: комментировать, что происходит на отдельной строчке. Это признак того, что код можно написать лучше.

Библиотеки и заголовочные файлы

Библиотека — это код, который можно переиспользовать в разных программах. В стандарт языка C++ входит спецификация так называемой стандартной библиотеки, которая поставляется вместе с компилятором. Она содержит различные структуры данных (контейнеры), типовые алгоритмы, средства ввода-вывода и т. д. Конструкции из этой библиотеки предваряются префиксом std::, который обозначает пространство имён.

Чтобы воспользоваться теми или иными библиотечными конструкциями, в начале программы надо подключить нужные заголовочные файлы. Так, в программе, которая печатала Hello, world!, нам уже встречался заголовочный файл iostream и конструкция std::cout из стандартной библиотеки.

Для C++ существует также множество сторонних библиотек. Наиболее известной коллекцией сторонних библиотек для C++ является Boost.

Ошибки компиляции

Перед запуском программу необходимо скомпилировать. Компилятор проверяет корректность программы и генерирует исполняемый файл. Во время компиляции компилятор может обнаружить синтаксические ошибки.

Рассмотрим пример такой программы:

#include <iostream>

int main() {
    cout << "Hello, worldn"

Компилятор может выдать такие сообщения:

$ clang++ hello.cpp
hello.cpp:4:5: error: use of undeclared identifier 'cout'; did you mean 'std::cout'?
    cout << "Hello, world!n"
    ^~~~
    std::cout

hello.cpp:4:30: error: expected ';' after expression
    cout << "Hello, world!n"
                             ^
                             ;

hello.cpp:5:1: error: expected '}'
^
a.cpp:3:12: note: to match this '{'
int main() {
           ^
3 errors generated.

Первая ошибка — вместо std::cout мы написали cout. Вторая ошибка — не поставили точку запятой после "Hello, world!n". Наконец, третья – не закрыли фигурную скобку с телом функции.

Ошибки компиляции (compile errors) следует отличать от возможных ошибок времени выполнения (runtime errors), которые происходят после запуска программы и, как правило, зависят от входных данных, неизвестных во время компиляции.

Отступы и оформление кода

Фрагменты программы на C++ могут быть иерархически вложены друг в друга. На верхнем уровне находятся функции, внутри них написаны их тела, в теле могут быть составные операторы, и так далее.

Среди программистов есть соглашение — писать внутренние блоки кода с отступами вправо: компилятор полностью игнорирует эти отступы, а код читать удобнее. Мы будем использовать отступы в четыре пробела. Также мы будем придерживаться стиля оформления кода, принятого в Яндексе. Имена переменных мы будем писать с маленькой буквы, имена функций и классов — с большой (если речь не идёт о конструкциях стандартной библиотеки, где действуют другие соглашения).

Переменные

Любая содержательная программа так или иначе обрабатывает данные в памяти. Переменная — это именованный блок данных определённого типа. Чтобы определить переменную, нужно указать её тип и имя. В общем виде это выглядит так:

Type name;

где вместо Type — конкретный тип данных (например, строка или число), а вместо name — имя переменной. Имена переменных должны состоять из латинских букв, цифр и знаков подчёркивания и не должны начинаться с цифры. Также можно в одной строке определить несколько переменных одного типа:

Type name1 = value1, name2 = value2, name3 = value3;

Например:

#include <string>  // библиотека, в которой определён тип std::string

int main() {
    // Определяем переменную value целочисленного типа int
    int value;

    // Определяем переменные name и surname типа std::string (текстовая строка)
    std::string name, surname;
}

В этом примере мы используем встроенный в язык тип int (от слова integer — целое число) и поставляемый со стандартной библиотекой тип std::string. (Можно было бы использовать для строк встроенный тип с массивом символов, но это неудобно.)

Тип переменной должен быть известен компилятору во время компиляции.

От типа зависит:

  • сколько байтов памяти потребуется для хранения данных;
  • как интерпретировать эти байты;
  • какие операции с этой переменной возможны.

Например, переменной типа int можно присваивать значения и с ней можно производить арифметические операции. Подробнее про разные типы данных и их размер в памяти мы поговорим ниже.

Важно понимать, что тип остаётся с переменной навсегда. Например, присвоить целочисленной переменной строку не получится — это вызовет ошибку компиляции:

int main() {
    int value;
    value = 42;  // OK
    value = "Hello!";  // ошибка компиляции!
}

Переменные можно сразу проинициализировать значением. В С++ есть много разных способов инициализации. Нам пока будет достаточно способа, который называется copy initialization:

#include <string>

int main() {
    int value = 42;
    std::string title = "Bjarne Stroustrup";
}

Если переменная, была объявлена, но нигде дальше не использовалась, то компилятор выдаёт об этом предупреждение. При проверке решений мы используем опцию -Werror, которая считает предупреждения компилятора ошибками компиляции.

Потоковый ввод и вывод

Поток — это абстракция для чтения и записи последовательности данных в форматированном виде.

Записывать данные можно на экран консоли, в файл, буфер в памяти или в строку. Считывать их можно с клавиатуры, из файла, из памяти. Причём с каждым таким «устройством» можно связать свой поток.

Важно, что потоки не просто пересылают байты памяти, а применяют форматированный человекочитаемый ввод-вывод. Например, числа печатаются и считываются в десятичной нотации, хотя в памяти компьютера они хранятся в двоичном виде.

В программе Hello, world! нам уже встречался поток вывода std::cout, по умолчанию связанный с экраном консоли. Познакомимся с потоком ввода std::cin, связанным с клавиатурой. Для его использования нужен тот же заголовочный файл iostream.

Рассмотрим программу, которая спрашивает имя пользователя и печатает персональное приветствие:

#include <iostream>
#include <string>

int main() {
    std::string name;  // объявляем переменную name
    std::cout << "What is your name?n";
    std::cin >> name;  // считываем её значение с клавиатуры
    std::cout << "Hello, " << name << "!n";
}

Обратите внимание на направление угловых скобок в этом примере — они условно показывают направление потока данных. При печати данные выводятся на экран, и стрелки направлены от текста к cout. При вводе данные поступают с клавиатуры, и стрелки направлены от cin к переменной.

В нашем примере в переменную name считается одно слово, которое будет выведено в ответном сообщении. Пример работы программы:

What is your name?
Alice
Hello, Alice!

Однако если ввести строку из нескольких слов с пробелами, то в name запишется только первое слово:

$ ./a.out
What is your name?
Alice Liddell
Hello, Alice!

Дело в том, что cin читает поток данных до ближайшего пробельного разделителя (пробела, табуляции, перевода строки или просто конца файла). Чтобы считать в строковую переменную всю строчку целиком (не включая завершающий символ перевода строки), нужно использовать функцию std::getline из заголовочного файла string:

#include <iostream>
#include <string>

int main() {
    std::string name;
    std::getline(std::cin, name);
    std::cout << "Hello, " << name << "!n";
}

В этом примере мы печатаем в одном выражении друг за другом несколько строк ("Hello, ", name и "!n"), разделённых угловыми скобками <<. Таким образом, cin и cout позволяют кратко считывать и печатать несколько объектов одной командой.

Например, считывание нескольких чисел целого типа, набранных через пробельные разделители, может выглядеть так:

int main() {
    int a;
    int b;
    int c;
    std::cin >> a >> b >> c;
}

Напечатать их значения можно следующим образом:

std::cout << a << " " << b << " " << c << "n";

Обратите внимание, что мы дополнительно вставляем между ними пробелы, чтобы в выводе числа не слиплись вместе. В конце вывода мы вставляем символ перевода строки n, чтобы отделить этот результат от последующего вывода или от сообщений командной строки.

Решение ошибок сборки⚓︎

При сборке пакетов иногда происходят ошибки.
В данном разделе будет описано решение наиболее распространённых ошибок.

Стадии, на которых может произойти ошибка⚓︎

Ошибка может произойти на любой стадии, однако чаще всего это случается после ввода make.
При этом в первую очередь определите действие, которое завершилось ошибкой — сделать это можно, просмотрев команду, завершившуюся с ошибкой.
В частности, если команда даётся компилятору (cc, gcc или clang), то произошла ошибка компиляции. Эти ошибки, обычно, наиболее трудны в решении.
Если команда даётся ld, то ошибка произошла при линковке.
Также ошибка может произойти, например, при построении документации. В этом случае самым простым вариантом будет отключение выполнения этого шага.

Общие принципы решения ошибок⚓︎

Убедитесь что ошибка воспроизводима — выполните make clean, а потом повторите make.
Если ошибка не исчезла, то прочитайте лог (хотя бы последние 30 строк).
Практически всегда там будет сказано о том, что за ошибка произошла.

Попробуйте поискать в интернете по частям лога, возможно, решение этой ошибки уже было где-либо описано.

Ошибки компиляции⚓︎

Ошибки компиляции — наиболее сложные в своём решении.
gcc всегда сообщает строку, в которой произошла ошибка — проверьте её.

Не найден заголовок⚓︎

Весьма простая ошибка.

Вывод⚓︎

dummy.c:1:10: fatal error: blablabla: No such file or directory
    1 | #include <blablabla>
      |          ^~~~~~~~~~~
compilation terminated.

Имя заголовка и файла может быть другим.

Решение⚓︎

Поищите этот заголовок в папке /usr/include и директории с исходным кодом пакета. Если он существует, то добавьте в переменную CPPFLAGS параметр -I/путь/к/директории/с/этим/заголовком. Если он не существует — установите пакет, который его предоставляет.

Ошибки линковки⚓︎

В процессе линковки несколько объектных файлов соединяются в один, и к ним подключаются библиотеки.

undefined reference to …⚓︎

Данная ошибка вызвана тем, что необходимая библиотека не была подключена.

Решение⚓︎

Попытайтесь определить, исходя из лога, какая библиотека не была подключена. Добавьте в переменную CFLAGS параметр -lsomelib (не надо указывать название файла библиотеки), например, -lcurses.

Ошибки configure⚓︎

Обычно они происходят из-за отсутствия зависимостей или их неработоспособности.

Первая прошивка


Итак, разобрались со средой разработки, теперь можно загрузить прошивку. Рекомендую загрузить пустую прошивку, чтобы убедиться, что все драйвера установились и плата вообще прошивается. Также лучше делать это с новой или заведомо рабочей платой.

1. Плата подключается к компьютеру по USB, на ней должны замигать светодиоды. Если этого не произошло:

  • Неисправен USB кабель.
  • Неисправен USB порт компьютера.
  • Неисправен USB порт Arduino.
  • Попробуйте другой компьютер, чтобы исключить часть проблем из списка.
  • Попробуйте другую плату, чтобы исключить часть проблем из списка.
  • На плате Arduino сгорел диод по питанию USB.
  • Плата Arduino сгорела полностью из-за неправильного подключения питания или короткого замыкания

2. Компьютер издаст характерный сигнал подключения нового оборудования, а при первом подключении появится окошко “Установка нового оборудования”. Если этого не произошло:

  • См. предыдущий список неисправностей.
  • Кабель должен быть data-кабелем, а не “зарядным”.
  • Кабель желательно втыкать напрямую в компьютер, а не через USB-хаб.
  • Не установлены драйверы для Arduino.

3. В списке портов (Arduino IDE/Инструменты/Порт) появится новый порт, отличный от COM1. Если этого не произошло:

  • См. предыдущий список неисправностей.
  • Некорректно установлен драйвер CH341.
  • Если список портов вообще неактивен – драйвер Arduino установлен некорректно, вернитесь к установке
  • Возникла системная ошибка, обратитесь к знакомому компьютерщику

4. Выбираем свою плату. Если это Arduino Nano, выбираем в ИнструментыПлатаArduino Nano. Если другая – выбираем другую. Нажимаем стрелочку в левом верхнем углу (загрузить прошивку). Да, загружаем пустую прошивку.

  • [Для Arduino Nano] В микроконтроллер китайских нанок зашит “старый” загрузчик, поэтому выбираем ИнструментыПроцессорATmega328p (Old Bootloader). Некоторые китайцы зашивают в свои платы новый загрузчик, поэтому если прошивка не загрузилась (загрузка идёт минуту и вылетает ошибка avrdude: stk500_getsync()) – попробуйте сменить пункт Процессор на ATmega328p.

Если появилась надпись “Загрузка завершена” – значит всё в порядке и можно прошивать другие скетчи. В любом случае на вашем пути встретятся другие два варианта событий, происходящих после нажатия на кнопку “Загрузка” – это ошибка компиляции и ошибка загрузки. Вот их давайте рассмотрим более подробно.

Ошибки компиляции


Возникает на этапе компиляции прошивки. Ошибки компиляции вызваны проблемами в коде прошивки.

  • В некоторых случаях ошибка возникает при наличии кириллицы (русских букв) в пути к папке со скетчем. Решение: завести для скетчей отдельную папочку в корне диска с английским названием.
  • В чёрном окошке в самом низу Arduino IDE можно прочитать полный текст ошибки и понять, куда копать.
  • В скачанных с интернета готовых скетчах часто возникает ошибка с описанием название_файла.h no such file or directory. Это означает, что в скетче используется библиотека <название файла>, и нужно положить её в Program Files/Arduino/libraries/. Ко всем моим проектам всегда идёт папочка с использованными библиотеками, которые нужно установить. Также библиотеки всегда можно поискать в гугле по название файла.
  • При использовании каких-то особых библиотек, методов или функций, ошибкой может стать неправильно выбранная плата в “Инструменты/плата“. Пример: прошивки с библиотекой Mouse.h или Keyboard.h компилируются только для Leonardo и Micro.
  • Если прошивку пишете вы, то любые синтаксические ошибки в коде будут подсвечены, а снизу в чёрном окошке можно прочитать более детальное описание, в чём собственно косяк. Обычно указывается строка, в которой сделана ошибка, также эта строка подсвечивается красным.
  • Иногда причиной ошибки бывает слишком старая, или слишком новая версия Arduino IDE. Читайте комментарии разработчика скетча
  • Ошибка недостаточно свободного места возникает по вполне понятным причинам. Возможно поможет урок по оптимизации кода.

Частые ошибки в коде, приводящие к ошибке компиляции


  • expected ‘,’ or ‘;’ – пропущена запятая или точка запятой на предыдущей строке
  • stray ‘320’ in program – русские символы в коде
  • expected unqualified-id before numeric constant – имя переменной не может начинаться с цифры
  • … was not declared in this scope – переменная или функция используется, но не объявлена. Компилятор не может её найти
  • redefinition of … – повторное объявление функции или переменной
  • storage size of … isn’t known – массив задан без указания размера

Ошибки загрузки


Возникают на этапе, когда программа успешно скомпилирована и производится загрузка в плату по кабелю. Ошибка может возникать как по причине неисправностей железа, так и из-за настроек программы и драйверов.

  • USB кабель, которым подключается Arduino, должен быть Data-кабелем, а не кабелем только для зарядки. Нужным нам кабелем подключаются к компьютеру плееры и смартфоны.
  • Причиной ошибки загрузки являются не установленные/криво установленные драйвера CH340, если у вас китайская NANO.
  • Также будет ошибка avrdude: ser_open(): can’t open device, если не выбран COM порт, к которому подключена Arduino. Если кроме COM1 других портов нет – читай два пункта выше, либо попробуй другой USB порт, или вообще другой компьютер.
  • Большинство проблем при загрузке, вызванных “зависанием” ардуины или загрузчика, лечатся полным отключением ардуины от питания. Потом вставляем USB и по новой прошиваем.
  • Причиной ошибки загрузки может быть неправильно выбранная плата в “Инструменты/Плата”, а также неправильно выбранный процессор в “Инструменты/Процессор”. Также в свежих версиях IDE нужно выбирать ATmega328P (Old Bootloader) для китайских плат NANO.
  • Если у вас открыт монитор COM порта в другом окне Arduino IDE или плата общается через СОМ порт с другой программой (Ambibox, HWmonitor, SerialPortPlotter и т.д.), то вы получите ошибку загрузки, потому что порт занят. Отключитесь от порта или закройте другие окна и программы.
  • Если у вас задействованы пины RX или TX – отключите от них всё! По этим пинам Arduino общается с компьютером, в том числе для загрузки прошивки.
  • Если в описании ошибки встречается bootloader is not responding и not in sync, а все предыдущие пункты этого списка проверены – с вероятностью 95% сдох загрузчик. Второй неприятный исход – загрузчик “слетел”, и его можно прошить заново.

Предупреждения


Помимо ошибок, по причине которых проект вообще не загрузится в плату и не будет работать, есть ещё предупреждения, которые выводятся оранжевым текстом в чёрной области лога ошибок. Предупреждения могут появиться даже тогда, когда выше лога ошибок появилась надпись “Загрузка завершена“. Это означает, что в прошивке нет критических ошибок, она скомпилировалась и загрузилась в плату. Что же тогда означают предупреждения? Чаще всего можно увидеть такие:

  • # Pragma message… – это просто сообщения, оставленные разработчиком проекта или библиотеки. Чаще всего номер версии и прочая информация.
  • Недостаточно памяти, программа может работать нестабильно – Чуть выше этого предупреждения обычно идёт информация о задействованной памяти. Память устройства можно добивать до 99%, ничего страшного не случится. Это флэш память и во время работы она не изменяется. А вот динамическую память желательно забивать не более 85-90%, иначе реально могут быть непонятные глюки в работе, так как память постоянно “бурлит” во время работы. НО. Это зависит от скетча и в первую очередь от количества локальных переменных. Можно написать такой код, который будет стабильно работать при 99% занятой SRAM памяти. Так что ещё раз: это всего лишь предупреждение, а не ошибка.

FAQ


Завершая раздел Введение в Arduino поговорим о вопросах, которые очень часто возникают у новичков:

  • Ардуину можно прошить только один раз? Нет, несколько десятков тысяч раз, всё упирается в ресурс Flash памяти. А он довольно большой.
  • Как стереть/нужно ли стирать старую прошивку при загрузке новой? Память автоматически очищается при прошивке, старая прошивка автоматически удаляется.
  • Можно ли записать две прошивки, чтобы они работали вместе? Нет, при прошивке удаляются абсолютно все старые данные. Из двух прошивок нужно сделать одну, причём так, чтобы не было конфликтов. Подробнее в этом уроке.
  • Можно ли “вытащить” прошивку с уже прошитой Ардуины? Теоретически можно, но только в виде нечитаемого машинного кода, в который преобразуется прошивка на С++ при компиляции, т.е. вам это НИКАК не поможет, если вы не имеете диплом по низкоуровневому программированию. Подробнее в этом уроке.
    • Зачем это нужно? Например есть у нас прошитый девайс, и мы хотим его “клонировать”. В этом случае да, есть вариант сделать дамп прошивки и загрузить его в другую плату на таком же микроконтроллере.
    • Если есть желание почитать код – увы, прошивка считывается в виде бинарного машинного кода, превратить который обратно в читаемый Си-подобный код обычному человеку не под силу.
    • Вытащить прошивку, выражаясь более научно – сделать дамп прошивки, можно при помощи ISP программатора, об этом можно почитать здесь.
    • Снять дамп прошивки можно только в том случае, если разработчик не ограничил такую возможность, например записав лок-биты, запрещающие считывание Flash памяти, или вообще отключив SPI шину. Если же разработчик – вы, и есть желание максимально защитить своё устройство от копирования – гуглите про лок-биты и отключение SPI

Видео


Полезные страницы


  • Набор GyverKIT – большой стартовый набор Arduino моей разработки, продаётся в России
  • Каталог ссылок на дешёвые Ардуины, датчики, модули и прочие железки с AliExpress у проверенных продавцов
  • Подборка библиотек для Arduino, самых интересных и полезных, официальных и не очень
  • Полная документация по языку Ардуино, все встроенные функции и макросы, все доступные типы данных
  • Сборник полезных алгоритмов для написания скетчей: структура кода, таймеры, фильтры, парсинг данных
  • Видео уроки по программированию Arduino с канала “Заметки Ардуинщика” – одни из самых подробных в рунете
  • Поддержать автора за работу над уроками
  • Обратная связь – сообщить об ошибке в уроке или предложить дополнение по тексту ([email protected])

Содержание

  • 1 Общий принцип
  • 2 Ввод и вывод данных
  • 3 Тестирование решений
    • 3.1 CE — Ошибка компиляции (Compilation Error)
    • 3.2 TLE — Нарушен предел времени (Time Limit Exceeded)
    • 3.3 ILE — Нарушен предел ожидания (Idleness Limit Exceeded)
    • 3.4 MLE — Нарушен предел памяти (Memory Limit Exceeded)
    • 3.5 RTE — Ошибка во время выполнения (Run-time Error)
    • 3.6 PE — Ошибка представления (Presentation Error)
    • 3.7 WA — Неправильный ответ (Wrong Answer)
    • 3.8 OK — Принято (Accepted)
    • 3.9 CF — Ошибка тестирования (Check Failed)
    • 3.10 SV — Нарушение безопасности (Security Violation)
  • 4 Особенности языков программирования
    • 4.1 Выбор языка программирования
  • 5 Конфигурация тестирующего сервера
  • 6 Языки программирования

Общий принцип

В систему посылаются только файлы с исходным кодом, а сама посылаемая программа должна состоять только из одного файла: *.dpr, *.cpp, *.java, *.pas и т. д. Нельзя отправить в систему скомпилированный exe-файл, файл проекта Visual Studio и т. п.

В решениях запрещается:

  • осуществлять доступ к сети;
  • выполнять любые операции ввода/вывода, кроме открывания, закрывания, чтения и записи стандартных потоков stdin, stdout, stderr и файлов с именами, явно прописанными в условии задачи;
  • сознательно «ломать» тестирующую систему;
  • выполнять другие программы и порождать новые процессы;
  • изменять права доступа к файловой системе;
  • работать с поддиректориями;
  • создавать и манипулировать ресурсами GUI (окна, диалоговые сообщения и т. д.);
  • работать со внешними устройствами (звук, принтер и т. д.);
  • выполнять прочие действия, призванные нарушить ход учебного процесса.

Решения выполняются в специальном окружении, обеспечивающем безопасный запуск, и попытка выполнить какие-либо из указанных действий закончится, скорее всего, получением вердикта «Ошибка во время выполнения».

Ввод и вывод данных

Во всех задачах необходимо считывать входные данные из текстового файла и выводить результат в текстовый файл. Имена файлов указаны в условии задачи. Предполагается, что файлы располагаются в текущем каталоге программы, поэтому в решениях можно и нужно использовать только их имена без абсолютных путей в файловой системе тестирующего сервера.

Можно считать, что изначально при запуске решения выходной файл будет отсутствовать, и решение должно его создать и записать туда ответ.

Внимательно проверяйте имена файлов в решениях на соответствие условию задачи.

Если в коде решения имена файлов указаны неверно, это может приводить к непредсказуемым последствиям. Так, если имя выходного файла указано неверно и требуемый по условию файл не создаётся, система, скорее всего, выдаст вердикт «Ошибка представления».
В случае, когда в решении на Java перепутано имя входного файла и делается попытка открыть несуществующий файл, выбрасывается исключение. Если автор решения не перехватывает его, программа завершается с вердиктом «Ошибка во время выполнения». Если же исключение обрабатывается, то вполне возможны и другие вердикты в зависимости от того, отработает ли программа и что окажется в выходном файле. Если в решении на C++ неправильно указан входной файл и ошибки специально не обрабатываются, чтение из файла может приводить к чтению произвольных данных («мусора»). Если в программе вместо чтения из файла делается попытка считать данные со стандартного ввода (stdin, который обычно связан с клавиатурой консоли), программа заблокируется («повиснет») в ожидании ввода и будет завершена с вердиктом «Превышен предел времени».

Решение может выводить произвольные данные «в консоль», то есть в стандартные потоки stdout, stderr, которые обычно связаны с консольным окном (например для отладки). Это не запрещается и не влияет на результат. Проверяется только содержимое выходного файла. Следует помнить, что на вывод тратится дополнительное время, поэтому большой объём отладочной информации может критически замедлить вашу программу. Вывод в stderr медленнее, чем в stdout, поскольку не буферизируется.

Тестирование решений

Каждое отправленное решение проходит на сервере проверку на нескольких тестах. Задача считается решённой только в случае прохождения всех тестов. Решение запускается на всех тестах, которые есть по задаче, и процесс тестирования не прерывается на первом непройденном тесте, как это делается в соревнованиях типа ACM.

Тестирование осуществляется автоматически, поэтому решения должны строго следовать формату входных и выходных данных, который описан в условии. В случае неясности можно задавать вопросы преподавателям. Если не сказано явно, все входные данные можно считать корректными и удовлетворяющими ограничениям из условия. Например, если сказано, что на входе целое число от 1 до 100 включительно, то можно считать, что это так и есть, и проверять неравенства и выводить ошибку в случае, если это не так, в коде решения нет необходимости.

Тесты по каждой задаче не упорядочены по сложности, по размеру входных данных, по какому-то иному критерию, а следуют в исторически сложившемся порядке их добавления в систему.

Не гарантируется, что первый тест в системе будет совпадать с тестом из условия (зачастую это не так).

Результатом проверки является итоговое сообщение системы и, возможно, в скобках номер первого теста, вызвавшего ошибку (если таковая имела место). Например, вердикт «Неправильный ответ (43)» означает, что решение успешно скомпилировалось и прошло без ошибок первые 42 теста по задаче, но на тесте под номером 43 выдало неверный ответ.

Далее опишем все допустимые сообщения тестирующей системы и укажем возможные причины их появления.

CE — Ошибка компиляции (Compilation Error)

Не удалось скомпилировать решение и получить исполняемый файл для запуска. Решение в таком случае, очевидно, не может быть проверено ни на одном тесте.

Посмотреть вывод компилятора и понять, почему код не удаётся скомпилировать, можно путём нажатия на иконку Compileerror.png в таблице с вашими решениями. Наиболее частые причины ошибки компиляции: выбран неверный компилятор (для другого языка программирования или же несовместимая версия, например Java v7 вместо Java v8), отправляется не тот файл (файл проекта IDE вместо файла с исходным кодом).

Время работы компилятора ограничено 30 секундами. Если он не успел отработать по каким-либо причинам, также будет выставлен вердикт «Ошибка компиляции».

TLE — Нарушен предел времени (Time Limit Exceeded)

Для каждого теста установлено своё ограничение по времени (Time Limit) в секундах. Для разных тестов по одной задаче ограничение по времени может быть разным.

Тестирующая система учитывает так называемое процессорное время (CPU Time) выполнения процесса в операционной системе. Нет смысла делать решение задачи многопоточным, потому что распараллеливание хоть и позволяет сократить реальное время работы (Wall Time), но не уменьшает процессорное время.

Процесс-решение запускается на тесте, и если процесс не успевает завершиться в течение отведённого времени, он принудительно завершается и выставляется вердикт «Нарушен предел времени». В качестве времени работы решения на тесте указывается то время, которое процесс фактически проработал до того, как был приостановлен. Нет возможности узнать, сколько бы программа проработала, если бы не была снята по времени. Если при ограничении по времени на тест в 1 секунду вы видите, что решение получает вердикт «Нарушен предел времени» и работает 1015 мс, то нельзя это понимать как «решение чуть-чуть не успевает, надо ускорить его на 15 мс». Если решение останавливается по времени, то вывод программы никак не проверяется на предмет его правильности.

Возможные причины появления ошибки «Нарушен предел времени»:

  • неэффективный алгоритм (например, в решении реализован алгоритм с временной сложностью Ω(n2), хотя задача предполагает решение за O(n log n));
  • недостаточно эффективная программная реализация (идея и алгоритм правильные, но код написан не очень хорошо: например, ввод данных из файла осуществляется медленно, чрезмерно часто выделяется и освобождается память);
  • попытка чтения данных с консоли (std::cin, scanf(), getchar() в C++, System.in в Java), тогда как нужно читать входные данные из файла (в этом случае программа блокируется в ожидании ввода и зависает, не расходуя при этом CPU Time, поэтому такой случай тестирующая система обрабатывает отдельно);
  • ошибка в программе (например, программа входит в бесконечный цикл).

Не рекомендуется «пропихивать» медленное решение, отправляя его многократно, пока система не «согласится» его принять. Решение в любой момент может быть перетестировано и, соответственно, может перестать быть принятым из-за нарушения предела времени.

ILE — Нарушен предел ожидания (Idleness Limit Exceeded)

Программа зависла в ожидании, не потребляя при этом ресурсы процессора.

Такое может быть, например, если согласно условию чтение входных данных осуществляется из файла, а решение выполняет ввод с консоли. В этом случае процесс решения заблокируется в ожидании нажатия клавиш на клавиатуре. Через некоторое время система тестирования принудительно завершит этот процесс и выставит вердикт ILE.

MLE — Нарушен предел памяти (Memory Limit Exceeded)

Программа использует слишком много оперативной памяти, стоит проанализировать использование памяти и оптимизировать его.
Также причиной чрезмерного использования памяти может быть ошибка в программе, например, вечный цикл в теле которого на каждой или некоторых итерациях выделяется дополнительная память. К используемой памяти относится не только память с данными, но также память с кодом и программным стеком.

Ограничение по памяти есть не для всех задач. Гарантируется, что для всех тестов в рамках одной задачи ограничение по памяти одинаково.

Как и в случае нарушения ограничения по времени, программа при нарушении ограничения по памяти аварийно завершается тестирующей системой, её вывод не проверяется на правильность. Точно так же не следует воспринимать размер памяти, использованной до момента аварийного завершения, как объём, которого решению хватило бы для успешной работы. Более точно, вердикт MLE, полученный с использованием 257 МБ памяти, говорит о том, что приложение успело использовать 257 МБ памяти и было принудительно остановлено, но ничего не говорит о том, сколько памяти использовало бы приложение, не будучи принудительно остановленным.

В некоторых случаях при разовом выделении чрезмерно большого блока в памяти, этот запрос может быть не выполнен операционной системой, что в результате может привести к ошибке во время выполнения или (значительно реже) другому результату неопределённого поведения в случае с языком C++.

RTE — Ошибка во время выполнения (Run-time Error)

В операционной системе есть такое понятие, как код завершения процесса (Exit Code). Этот подход используется как в Windows, так и в ОС семейства UNIX. Это целое число, которое остаётся после прекращения выполнения программы. Общепринятое соглашение гласит, что нулевой код завершения свидетельствует о нормальном завершении процесса без ошибок, любой другой — об ошибке. Тестирующая система проверяет код завершения вашего решения, и если он не равен нулю, выставляет вердикт «Ошибка во время выполнения». При этом никак не проверяется то, что решение успело вывести в выходной файл.

Укажем типичные причины ошибок во время выполнения.

  • Использована директива package в коде программы на Java.
    В результате программа на Java находится не в пакете по умолчанию. Компилятор Java сгенерировал класс в некотором пакете (ошибки компиляции нет), а при запуске виртуальная машина Java не смогла найти этот класс, потому что искала в пакете по умолчанию (возникло исключение ClassNotFoundException с сообщением Could not find or load main class).
  • Выход за границы допустимой области памяти в программе на C++.
    Выход за границы массива, разыменование неправильного указателя, обращение к нулевому указателю.
  • Переполнение системного стека.
    Эта причина является частой в случае рекурсии. Вообще, системный стек используется для размещения параметров функций, локальных переменных. Его размер, как правило, невелик и по умолчанию равен 1 МБ. При вызове функции стековая структура позволяет естественным образом сохранить текущие состояния всех локальных переменных и вернуться к ним, когда вызов завершится и управление вернётся в исходную точку. Если в алгоритме используется глубокая рекурсия, то размера стека может не хватить для хранения контекстов всех вызовов. Решений этой проблемы два:

    1. переписать алгоритм нерекурсивно (например с использованием своего стека, а не системного);
    2. увеличить размер системного стека, что делается по-разному для разных языков программирования (см. примеры для C++ (Visual Studio) и Java).
  • Ошибка ввода-вывода (попытка открыть несуществующий входной файл).
    Нужно проверить правильность имени входного файла.
  • Программа целенаправленно была завершена с ненулевым кодом выхода.
    В программе на C++ это может быть, если функция main() в C++ вернула ненулевой код (return (non-zero) в функции main()). Рекомендуется завершать функцию main() оператором return 0 (в старых компиляторах C++ это обязательно, современные компиляторы же подразумевают возврат нулевого кода автоматически). Также программу на C++ с произвольным кодом завершает вызов exit().
    В программе на Java можно завершить процесс с произвольным кодом с помощью System.exit().
  • Необработанное исключение.
    Причин возникновения исключений может быть масса. Например, если в Java функции Integer.parseInt() / Double.parseDouble() была передана строка, содержащая пробельные символы (ASCII-коды 9, 10, 13, 32), выбрасывается исключение NumberFormatException.
  • Целочисленное деление на ноль.
    При выполнении деления нужно всегда думать, а не может ли делитель оказаться равным нулю. В то же время стоит отметить, что вещественное деление на ноль (в типах с плавающей точкой double, float) по умолчанию не приводит к завершению программы, а даёт специальные значения +Inf, -Inf или NaN.

PE — Ошибка представления (Presentation Error)

Наиболее частая причина возникновения этой ошибки — не найден выходной файл. Возможно, вы забыли создать выходной файл и выводите ответ в консоль (он в таком случае игнорируется). Проверьте имена входного и выходного файла в вашей программе на соответствие условию задачи. Исторически сложилось, что в разных задачах входной и выходной файл именуются по разным правилам: input.txt и output.txt, in.txt и out.txt, input.in и output.out (обратите внимание, что нет расширения txt), [задача].in и [задача].out

Для некоторых задач программа проверки (checker) дополнительно удостоверяется, что ваш вывод соответствует определённому формату, и выдаёт ошибку представления в случае, если это не так. Например, если в задаче нужно вывести число, а вы выводите строку. Или если в задаче нужно вывести сначала число k, затем k чисел, а ваше решение выводит число k и далее (k + 1) чисел (то есть решение выводит в файл лишние данные).

Также имейте в виду, что отлавливание исключений и других ошибок не должно быть самоцелью. Если исключение не обрабатывается каким-либо образом, обычно нет смысла его ловить по следующей причине. Аварийное завершение работы программы в результате ошибки во время выполнения приводит к вердикту «Ошибка во время выполнения», только если соответствующее исключение было «проброшено» наружу, а не «заглушено» на каком-то этапе. Если исключение отлавливается, но никак не обрабатывается, то в результате возникновения соответствующей ошибки следует ожидать вердикт «Ошибка представления» или же «Неправильный ответ» (реже).

WA — Неправильный ответ (Wrong Answer)

Для многих задач ответ однозначен, и проверяется просто побайтовое совпадение вашего выходного файла и сохранённого правильного ответа. Такая проверка требует строгого соблюдения формата файла, не допускает незначащих пробелов и пустых строк. Например, если правильный ответ имеет вид (пробелы обозначены символом ␣)

5
1␣2␣3␣4␣5

и решение вывело

5
1␣2␣3␣4␣5␣

(лишний пробел в конце второй строки), то будет получен вердикт «Неправильный ответ». Для некоторых задач написаны проверяющие программы (checker), которые к таким различиям лояльны и засчитывают ответы с лишними пробелами как правильные. Всегда точно следуйте формату файла и не выводите лишних пробелов, и проблем не будет.

После последней строки файла можно выводить или не выводить перевод строки — не важно. Есть две точки зрения в зависимости от того, с какой стороны смотреть на символ перевода строки:

  1. каждая строка завершается переводом строки, поэтому n в конце файла нужен;
  2. перевод строки является разделителем между соседними строками, поэтому n в конце файла не нужен.

Первая точка зрения является общепринятой. Так, компилятор gcc, система контроля версий git и многие другие программы выдают предупреждение no newline at the end of file, если в самом конце файла нет символов новой строки. Обсуждение вопроса можно почитать на stackoverflow.

Поэтому рекомендуется придерживаться первого подхода и завершать все строки переводами строк.

Другие очевидные причины получения неправильного ответа:

  • неверный алгоритм;
  • ошибка в программе.

Бывает такое, что решение от запуска к запуску даёт разные ответы, или же правильно работает на одном компьютере и неправильно на другом. Такие случаи, как правило, связаны с ошибками в решениях.

OK — Принято (Accepted)

Программа работает правильно и прошла все тесты с соблюдением всех ограничений.

Если решение принято системой, это ещё не означает, что в его основе лежит правильный алгоритм. В любой момент могут появиться новые наборы входных данных, на которых будут заново протестированы все решения по задаче. Если ваше решение на самом деле не полностью верно и прошло только из-за недостаточно сильного набора тестов, оно может в будущем потерять статус «Принято».

CF — Ошибка тестирования (Check Failed)

Если указан номер теста, то программа успешно завершается на предложенном тесте (укладывается в отведённые время и память и не совершает ошибок во время выполнения), но результат не удаётся проверить из-за ошибок в программе проверки. Вашей ошибки в этом случае, возможно, никакой нет и после исправления программы проверки будет получен вердикт OK. Не исключены ещё два варианта: WA, PE.

Имейте в виду, что если ошибка тестирования возникает на первом же тесте, то на остальных Ваше решение не запускается вовсе. Соответственно, в этом случае после устранения ошибок программы проверки вердикты TLE, MLE, RTE также могут возникнуть в любом тесте, кроме первого.

Если же номер теста, на котором возникает ошибка тестирования, не указан, значит, программа проверки не была скомпилирована, а Ваше решение не запускалось вовсе. В этом случае правильным может быть любой вердикт, отличный от CF.

Если у Вас возникла ошибка тестирования, мы, скорее всего, это заметим достаточно быстро. Тем не менее, имеет смысл задать вопрос через пункт «Сообщения» в меню курса. Не забывайте выбрать задачу, которой касается этот вопрос.

SV — Нарушение безопасности (Security Violation)

Ошибка означает, что программа попыталась выполнить запрещённые действия.

К их числу относится попытка создания новых процессов. Вашим решениям запрещено запускать на выполнение другие программы. Например, в коде

порождается новый процесс командной оболочки cmd.exe и в нём выполняется команда pause. Пожалуйста, не пишите так, для достижения аналогичного эффекта можно использовать другие приёмы.

Особенности языков программирования

У каждого конкретного языка программирования есть свои особенности, о которых полезно знать. Далее рассмотрены отдельные особенности написания решений на разных языках программирования:

  • C++;
  • Java;
  • C#;
  • Python.

Выбор языка программирования

Разные задачи можно решать на разных языках. Часто для конкретной задачи тот или иной язык оказывается предпочтительным. Например, если в задаче требуются тяжёлые вычисления, то её может быть проще сдать на C++, чем на Java, за счёт более быстрой работы программы на C++ (для кода на Java могут потребоваться более изощрённые оптимизации, чтобы он прошёл по времени). С другой стороны, если задача требует проведения вычислений с большими целыми числами, выходящими за пределы диапазона 64-битных переменных, то есть «длинной арифметики», то решение существенно проще написать на Java, воспользовавшись готовым качественно написанным классом BigInteger для операций с числами произвольной длины.

Конфигурация тестирующего сервера

Сервер, на котором осуществляется запуск решений, является виртуальной машиной, выполняющейся внутри Microsoft Hyper-V Server 2012 R2. Виртуальный компьютер работает под управлением Windows 7 Professional x64, оснащён процессором Intel® Core™ i3-4130 (Haswell, кэш 3 МБ, 3,40 ГГц, доступно только одно ядро) и 4 ГБ оперативной памяти. Для хранения входных и выходных файлов используется RAM-диск, чтобы обеспечить максимальную производительность ввода-вывода.

Языки программирования

На странице учебного курса в системе на вкладке «Компиляторы» можно ознакомиться с актуальным списком доступных языков программирования, версиями компиляторов и параметрами командной строки их вызова.

Размер системного стека явно не задаётся (используется размер по умолчанию). При компиляции кода на C++ включен режим оптимизации O2.

  • D.1.Сообщения об ошибках компилятора.
    • D.1.1. Сообщения о фатальных ошибках.
    • D.1.2. Сообщения об ошибках компилятора.
    • D.1.3. Предупреждающие сообщения.
    • D.1.4. Ограничения компилятора.
  • D.2.Сообщения об ошибках в командной строке.
    • D.2.1. Неисправимые ошибки командной строки.
    • D.2.2. Сообщения об ошибках командной строки.
    • D.2.3. Предупреждающие сообщения командной строки.
      • D.3. Сообщения об ошибках периода выполнения.
    • D.3.1. Исключительные ситуации операций с плавающей точкой.
    • D.3.1. Сообщения об ошибках периода выполнения.
    • D.3.3. Ограничения периода выполнения.
  • D.4. Сообщения об ошибках компановщика.
  • D.5.Сообщения об ошибках утилиты LIB.
  • D.6. Сообщения об ошибках утилиты MAKE.

В данном Приложении приводится список сообщений об ошибках, на которые вы можете натолкнуться в процессе разработки программ, и, кроме того, дает краткое описание действий, которые вам следует предпринять для исправления ошибок. Следующий список покащывает вам, где искать ошибочные сообщения различных компонентов компилятора Microsoft Quick-C:

Компонент                         Раздел

Компилятор Microsoft Quick-C      Раздел D.1, "Сообщения об ошибках
                                  компилятора.
Командная строка, используемая    Раздел D.2, "Сообщение об ошибках
для вызова компилятора Quick-C    командной строки".
Библиотеки исполняющей системы    Раздел D.3, "Сообщения об ошибках
Microsoft C и другие ситуации     периода выполнения".
периода выполнения.
Оверлейный компановщик Microsoft, Раздел D.4, "Сообщения об ошибках
утилита LINK.                     компановщика".
Диспетчер библиотек фирмы         Раздел D.5, "Сообщения об ошибках
Microsoft-утилита LIB             утилиты LIB".
Утилита поддержки разработки      Раздел D.6, "Сообщения об ошибках
программ MAKE                     утилиты MAKE".

Обратите внимание, что все ошибочные сообщения компилятора, командной строки, периода выполнения приведены в данном приложении в алфавитном порядке.

В Разделе D.1.4 вы найдете информацию об ограничениях компилятора, а в Разделе D.3.3-ограничения периода выполнения.

D.1.Сообщения об ошибках компилятора.

Сообщения об ошибках, Полученные при сбоях СИ-компилятора, делятся на три категории:

1.Сообщения о фатальных ошибках.

2.Сообщения об ошибках компиляции.

3.Предупреждающие сообщения.

Сообщения каждой категории даны ниже в пронумерованном порядке, с кратким объяснением каждой ошибки. Чтобы найти требуемое сообщение, сначала определите категорию сообщения, затем найдите соответствующий номер ошибки. Каждое сообщение, сгенерированное в среде Quick-C, появляется в окне ошибок; курсор устанавливается на строке, вызвавшей ошибку (подробности в Разделе 7.3.4). Каждое сообщение об ошибке, сгенерированное во время компиляции с помощью команды QCL, содержит имя файла и номер строки, вызвавшей ошибку.

Сообщения о фатальных ошибках.

Сообщение о фатальной ошибке обозначает некоторую проблему, которая запрещает компилятору дальнейшее выполнение. Данный тип сообщения имеет следующий формат:

имя файла(строка): fatal error C1xxx: текст сообщения После того, как компилятор высветит сообщение о фатальной ошибке, он завершит выполнения без создания объектного файла и какой-либо проверки на последующие ошибки.

Сообщения об ошибках компилятора.

Сообщения об ошибках компилятора индицируют реальные программные ошибки. Данные сообщения выводятся в следующем формате:

имя файла(строка):error C2xxx:текст сообщения

Компилятор в данном случае не создает объектный файл для исходного файла, в котором компилятор обнаружил ошибки. Если компилятор встречает такие ошибки, он делает попытку их исправить. Если это возможно, он продолжает обработку исходного файла и выдает ошибочные сообщения. Если ошибок слишком много или они слишком серьезны, компилятор прекращает работу.

Предупреждающие сообщения.

Предупреждающие сообщения носят только информативный характер; они не прерывают процесс компиляции или компановки. Данные сообщения появляются в следующем формате:

имя файла(строка): warning C4xxx: текст сообщения

Вы можете использовать опцию /W для управления уровнем сообщений, генерируемых компилятором. Данная опция описана в Разделе 9.3.1.

D.1.1. Сообщения о фатальных ошибках.

Следующие сообщения идентифицируют фатальные ошибки. Компилятор не может исправить фатальную ошибку; он прекращает работу после распечатки сообщения об ошибке.

Номер   Сообщение о фатальной ошибке


C1000 "Неизвестная фатальная ошибка, Свяжитесь с Техническим сервисом
      фирмы Microsoft".
      Компилятор обнаружил неизвестную ошибку. Пожалуйста, сообщите
      фирме Microsoft Corporation условия возникновения данной ошиб-
      ки посредством специальной формы "Product Assistan Request",
      на обложке данного руководства.
C1001 "Внутренняя ошибка компилятора, свяжитесь с Техническим серви-
      сом фирмы Microsoft".
      Компилятор обнаружил внутреннее несоответствие. Пожалуйста, со-
      общите условия возникновения данной ошибке с помощью бланка
      "Product Assistance Request" на обложке данного руководства.
      Пожалуйста, включите в ваше сообщение имя файла и номер стро-
      ки, вызвавшей ошибку; обратите внимание, что "имя файла" отно-
      носится к внутреннему файлу компилятора, а не к вашему исход-
      ному файлу.
C1002 "Выход за пределы динамической области".
      Компилятор вышел за пределы динамическогй области памяти. Дан-
      ная ситуация обычно означает, что ваша программа имеет слишком
      много символических имен и/или комплексных выражений. Чтобы из-
      бавиться от данной проблемы, разделите файл на несколько мень-
      ших исходных файлов, либо разбейте выражения на меньшие подвы-
      ражения.
C1003 "Счетчик ошибок превысил n; компиляция остановлена".
      Ошибок в программе слишком много, либо они слишком серьезны,
      чтобы возможно было восстановление, компилятор должен прервать
      выполнение.
C1004 "Неожиданный конец файла (EOF).
      Данное сообщение появляется, если у вас не достаточно памяти на
      стандартном дисковом устройстве, чтобы компилятор создал требу-
      емые временные файлы. Требуемое пространство примерно в 2 раза
      больше размера исходного файла. Данное сообщение может быть
      также сгенерировано, если комментарий не имеет закрывающего
      ограничителя (*/), либо если директиве #if не хватает закры-
      вающей директивы #endif.
C1005 "Строка слишком велика для буфера".
      Строка в промежуточном файле компилятора переполняет буфер.
C1006 "Ошибка записи в промежуточный файл компилятора".
      Компилятор не может создать промежуточные файлы, используемые
      в процессе компиляции. К данной ошибке обычно приводят следую-
      щие ситуации:
      1.Слишком мало файлов в строке
      files = number
      файла CONFIG.SYS (компилятор требует чтобы число number было
      не меньше 15).
      2.Не хватает памяти на устройстве, содержащем промежуточные
      файлы компилятора.
C1007 "Нераспознанный флаг 'string' в 'option'"
      string-в опции командной строки option не является корректной
      опцией.
C1009 "Ограничения компилятора, возможно рекурсивно определенное мак-
      роопределение".
      Расширение макрокоманды превышает размеры доступной памяти.
      Проверьте, не было ли рекурсивно-определенных макрокоманд, либо
      не слишком велик расширяемый текст.
C1010 "Ограничения компилятора: макро-расширение слишком большое".
      Расширение макрокоманды превышает доступную память.
C1012 "Неверное вложение скобок-пропущенный 'character' (символ)".
      Несоответствие скобок в директиве препроцессора; 'character'-
      -это либо левая, либо правая скобка.
C1013 "Невозможно открыть исходный файл 'filename'".
      Данный файл 'filename' либо не существует, либо не может быть
      открыт, либо не найден. Удостоверьтесь, что параметры установ-
      ки среды корректны, и что для файла задано корректное имя марш-
      рута.
C1014 "Слишком много включаемых файлов".
      Вложение директив #include превышает 10-уровневый предел.
C1015 "Невозможно открыть включаемый файл 'filename'".
      Данный файл либо не существует, либо не может быть открыт, либо
      не найден. Удостоверьтесь, что параметры неазначений среды за-
      даны корректно, и что вы определили корректное имя маршрута для
      данного файла.
C1016 "Директиве #if [n]def требуется идертификатор".
      С директивами #ifdef и #ifndef вы обязательно должны употреб-
      лять идентификатор.
C1017 "Неверное выражение целой константы".
      Выражение в директиве #if должно вычисляться в константу.
C1018 "Неожиданная директива '#elif'".
      Появление директивы #elif разрешено только внутри директив #if,
      #ifdef, или #ifdef.
C1019 "Неожиданная директива '#else'".
      Появление директивы #else возможно только внутри директив #if,
      #ifdef, или #ifndef.
C1020 "Неожиданная директива '#endif'"
      Директива #endif появилась без соответствующей директивы #if,
      #ifdif, или #ifndef.
C1021 "Неверная команда препроцессора 'string'"
      Символы, следующие за знаком (#) формируют неверную директиву
      препроцессора.
C1022 "Ожидается директива '#endif'".
      Директива #if, #ifdef или #ifndef не заканчивается директивой
      #endif.
C1026 "Переполнение стэка, пожалуйста, упростите вашу программу."
      Ваша программа не может быть далее обработана, поскольку па-
      мять, требуемая для "разбора" программы переполняет стэк ком-
      пилятора.
      Чтобы разрешить данную проблему, упростите вашу программу.
C1027 "Ограничения компилятора: вложение структур/смесей".
      Определения структур и смесей вложены более 10 раз.
C1028 "Сегмент segment занимает более 64К"
      В данном сегменте размещены более 64 "дальних" данных. Один мо-
      дуль может иметь не более 64К "дальних" данных.
      Чтобы разрешить данную проблему, либо разбейте объяснения на
      отдельные модули, сократите общий объем используемых данных,
      либо откомпилируйте вашу программу с помощью Оптимизирующего
      компилятора Microsoft-C.
C1032 "Невозможно открыть файл, содержащий объектный листинг
      'filename'".
      Имеет силу одно из следующих утверждений, касающихся имени фай-
      ла или имени маршрута:
      1.Данное имя не верно.
      2.Файл с данным именем не может быть открыт из-за нехватки
        памяти.
      3.Уже существует файл с данным именем и атрибутом "только-чте-
        ние".
C1033 "Невозможно открыть выходной файл на языке ассемблер
      'filename'".
      Одно из условий, рассмотренных в описании ошибки с кодом C1032,
      привело к невозможности открыть данный файл.
C1034 "Невозможно открыть исходный файл 'filename'".
      Одно из условий, рассмотренных в описании ошибки с кодом C1032,
      привело к невозможности открыть данный файл.
C1035 "Выражение является слишком сложным, пожалуйста упростите".
      Компилятор не смог сгенерировать код для сложного выражения.
      Чтобы разрешить данную проблему, разбейте выражение на более
      простые подвыражения и повторите компиляцию.
C1036 "Невозможно открыть файл, содержащий исходный листинг
      'filename'".
      Одно из условий, рассмотренных в описании ошибки с кодом C1032,
      привело к невозможности открыть данный файл.
C1037 "Невозможно открыть объектный файл 'filename'".
      Одно из условий, рассмотренных в описании ошибки с кодом C1032,
      привело к невозможности открыть данный файл.
C1039 "Невосстанавливаемое переполнение динамической области в треть-
      ем проходе компилятора":
      В третьем оптимизирующем проходе компилятор переполнил динами-
      ческую область и прекратил работу.
      Попытайтесь повторить компиляцию с включенной опцией Optimiza-
      tions (в среде программирования Quick-C), либо с опцией /Od (в
      командной строке QCL), либо попытайтесь отделить функцию, со-
      держащую строку, вызвавшую ошибку.
C1040 "Неожиданный EOF в исходном файле 'filename'".
      В процессе создания листинга исходного файла, либо исходного/
      объектного файла компилятор обнаружил неожиданный конец файла.
      Данная ошибка произошла, вероятно, если исходный файл был отре-
      дактирован в процессе компиляции.
C1041 "Невозможно открыть промежуточный файл компилятора-больше нет".
      Компилятор не может создать промежуточный файл, используемый в
      процессе компиляции, поскольку больше нет логических номеров
      файлов.
      Данная ошибка может быть исправлена путем изменения строки
      files=number в файле CONFIG.SYS, чтобы задать большее число од-
      новременно открытых файлов (рекомендуется назначить число 20).
C1042 "Невозможно открыть промежуточный файл компилятора-нет такого
      файла или каталога".
      Компилятор не может создать промежуточные файлы, используемые в
      процессе компиляции, поскольку в переменной операционный среды
      TMP задан неправильный каталог, или маршрут.
C1043 "Невозможно открыть промежуточный файл компилятора".
      Компилятор не может создать промежуточные файлы, используемые в
      процессе компиляции. Точная причина неизвестна.
C1044 "Нехватка дисковой памяти для промежуточного файла компилятора"
      Из-за недостатка памяти компилятор не может создать промежуточ-
      ный файл, используемый в процессе компиляции. Для исправления
      данной ситуации освободите место на диске и повторите компиля-
      цию.
C1045 "Переполнение при операции с плавающей точкой".
      Компилятор получил ошибку при присваивании арифметических конс-
      тант элементам с плавающей точкой, как в следующем примере:
           float fp val = 1.0e100;
      В данном примере константа двойной точности 1.0е100 превышает
      максимально-допустимое значение для данных с плавющей точкой.
C1047 "Слишком много появлений опции 'string'".
      Данная опция упоминается слишком много раз. Строка 'string' со-
      держит опцию, вызвавшую ошибку.
C1048 "Неизвестная опция 'character' в 'optionstring'".
      Символ является некорректной буквой для опции 'optionstring'.
C1049 "Неверный числовой аргумент 'string'".
      Вместо string ожидался числовой аргумент.
C1050 "Сегмент кода 'segmentname' слишком большой".
      В процессе компиляции сегмент кода вырос за пределы 36 байтов
      от 64К.
      В данном случае используется 36-байтовый заполнитель, поскольку
      сбой на некоторых платах микропроцессоров 80286 могут вызвать
      непредсказуемое поведение программ, если среди прочих условий
      размер кодового сегмента находится в пределах 36 байтов от 64К.
C1052 "Слишком много директив #if/#ifdef's".
      В программе превышено максимальное число уровней вложения ди-
      #if/#ifdef.
C1053 "Размещение данных DGROUP превышает 64К".
      В стандартном сегменте данных были размещены более 64К перемен-
      ных.
      Для программ компактной, средней и большой модели памяти выпол-
      няйте компиляцию с помощью команды QCL, используя опцию
      /GT для размещения элементов данных в отдельных сегментах.
C1054 "Ограничения компилятора: слишком глубокая вложенность инициа-
      заторов".
      Были превышены ограничения компилятора на вложенность инициали-
      заторов. Предел - от 10 до 15 уровней, в зависимости от комби-
      нации инициализируемых типов.
      Чтобы решить данную проблему, для сокращения уровней вложен-
      ности упростите тип инициализируемых данных, либо после опи-
      санияия присваивайте первоначальное значение в отдельных опе-
      раторах.
C1056 "Ограничения компилятора: переполнение в процессе макро-расши-
      рения".
      Компилятор переполнил внутренний буфер при расширения
      макрокоманды.
C1057 "Неожиданный EOF в макро-расширении; (пропущено ')'?)".
      Компилятор обнаружил конец исходного файла в процессе сборки
      аргументов макро-вызова. Обычно, это является результатом опу-
      щенной  закрывающей правой скобки) в макро-вызове, как и в сле-
      дующем примере:
      #define print(a) printf(string is(,#a))
      main()
      {
           print(the quick brown fox;
      }
C1059 "Превышены пределы "ближней" динамической области".
      При размещении элементов данных в "ближней" динамической обла-
      сти (стандартный сегмент данных), компилятор вышел за допусти-
      мые пределы.
C1060 "Превышены пределы "дальней" динамической области".
      При размещении элементов данных в "дальней" динамической облас-
      ти компилятор вышел за допустимые пределы памяти. Обычно дан-
      ная ошибка происходит во встроенных в память программах, по
      причине того, что таблица имен содержит слишком много имен.
      Чтобы исправить данную ситуацию, попробуйте выполнить компиля-
      цию с выключенной опцией Debug, либо попытайтесь подключить
      меньше включаемых файлов. Если такой способ не спасает ситу-
      ацию, выполните компиляцию программы посредством команды QCL.
C1061 "Ограничения компилятора: слишком глубокое вложение блоков".
      Вложенность блоков в данной прогамме превышает возможности ком-
      пилятора. Для исправления данной ситуации перепишите программу
      так, чтобы вложенность блоков была меньшей.
C1063 "Ограничения компилятора-переполнение стека компилятора".
      Ваша программа слишком сложна, поскольку привела к переполнению
      стека. Упростите вашу программу и повторите компиляцию.

D.1.2. Сообщения об ошибках компилятора.

Сообщения, перечисленные ниже, означают, что ваша программа имеет ошибки. Когда компилятор встречает одну из ошибок, перечисленных в данном разделе, программа продолжает рассматриваться (если возможно), причем продолжают выводиться оставшиеся сообщения об ошибках. Однако, объектный файл не строится.

Номер         Сообщения об ошибках компилятора


C2000 "Нераспознанная ошибка. Обратитесь в Технический сервис фирмы
      Microsoft".
      Компилятор не может определить тип обнаруженной ошибки. Пожа-
      луйста, сообщите условие возникновения данной ошибки в фирму
      Microsoft, воспользовавшись специальным бланком "Product Assis-
      tance Reguest", находящимся на обложке данного руководства.
C2001 "В константе обнаружен символ перехода на новую строку
      (newline)".
      Символ перехода на новую строку в символьной или строковой
      константе употребляется не в корректной форме управляющей
      последовательности (/n).
C2002 "Фактические параметры макрокоманды превышают допустимые пре-
      делы памяти".
      Аргументы макро-препроцессора превышабт 256 байтов.
C2003 "Требуется идентификатор".
      Идентификатор для проверки условия в #if не найден.
C2004 "Требуется идентификатор".
      Директива #if вызвала синтаксическую ошибку.
C2005 "В директиве #line требуется номер строки".
      В директиве #line не хватает заданного номера строки.
C2006 "Директиве #include требуется имя файла".
      В директиве #include не хватает спецификации имени файла.
C2007 "Синтаксическая ошибка директивы #define".
      В директиве #define была обнаружена синтаксическая ошибка.
C2008 "'character': невозможен в макроопределении".
      Данный символ был использован в макроопределении некорректно.
C2009 "Повторное использование формального параметра 'identifier'
      макроопределения".
      Данный идентификатор был дважды использован в списке формальных
      параметров макроопределения.
C2010 "'character': невозможен в формальном списке".
      Данный символ был некорректно использован в списке формальных
      параметров макроопределения.
C2011 "'identifier': определения слишком велико".
      Данное макроопределение превышает 256 байтов.
C2012 "Пропущено имя, следующее за '<'".
      В директиве #include не хватает требуемой спецификации имени
      файла.
C2013 "Не хватает знака '>'".
      В директиве #include пропущена закрывающая угловая скобка (>)
C2014 "Команда препроцессора должна начинаться с первого значащего
      (не пробельного) символа".
      В директиве препроцессора на той же самой строке появились не
      пробельные символы перед знаком #.
C2015 "Слишком много символов в константе".
      Символьная константа содержит более одного символа, либо была
      использована управляющая последовательность.
C2016 "Отсутствует закрывающая одинарная кавычка".
      Символьная константа не была заключена в одинарные кавычки.
C2017 "Некорректная  управляющая последовательность".
      Символ или символы, следующие за знаком () не имеют корректной
      формы для управляющей последовательности.
C2018 "Неизвестный символ 'Oxcharacter'".
      Данное шестнадцатеричное число не соответствует символу.
C2019 "Требуется команда препроцессора, обнаружен символ 'character'"
      Данный символ следует за знаком (#), но не является первой бук-
      вой директивы препроцессора.
C2020 "Неверное восьмеричное число 'character'".
      Данный символ не является корректной восьмеричной цифрой.
C2021 "Число 'number'слишком велико для символа".
      Число 'number' слишком велико, чтобы представлять символ.
C2023 "Деление на нуль".
      Второй операнд операции деления (/) при вычислении дает нуль.
      что может привести к непредсказуемым результатам.
C2024 "По модулю 0".
      Второй операнд в остатке операции (%) при вычислении дает нуль,
      что может привести к непредсказуемым результатам.
C2025 "'identifier': переопределение типа enum/struct/union".
      Данный идентификатор уже был использован в перечислении, струк-
      туре или тэге смеси.
C2026 "'identifier': переопределение числа перечисления ".
      Данный идентификатор уже был использован в константе перечисле-
      ния, либо в том же самом типе перечисления, либо в другом типе
      перечисления в том же самом виде.
C2028 "Член структуры/смеси должен находиться внутри структуры/смеси"
      Члены структуры или смеси должны быть описаны внутри структу-
      ры или смеси. Данная ошибка может быть вызвана описанием пе-
      речисления, содержащим описание члена структуры, как в следу-
      ющем примере:
      enum a {
             january,
             february,
             int march; /* описание структуры :
                        ** некорректно
                        */
             };
C2029 "'identifier': битовые поля разрешены только в структурах".
      Только структуры могут содержать битовые поля.
C2030 "'identifier': переопределение члена структуры/смеси".
      Данный идентификатор был более одного раза использован в качес-
      тве члена одной и той же структуры/смеси.
C2031 "'identifier': функция не может быть членом структуры или сме-
      си".
      Данная функция была описана в качестве члена структуры или
      смеси. Для исправления данной ошибки воспользуйтесь указателем
      на функцию.
C2032 "'identifier': базовый тип с ключевыми словами near/far/huge не
      разрешен".
      Данный член структуры или смеси был описан с ключевыми слова-
      ми far и near.
C2033 "'identifier': к битовым полям нельзя применять оператор кос-
      венного обращения (*)".
      Данное битовое поле было описано как указатель (*), что не
      разрешено.
C2034 "'identifier': битовое поле слишком мало для данного количества
      разрядов".
      Количество разрядов, заданное в описаний битового поля превы-
      ша%т количест-о разрядов в данеод базовом т(пе.
C2040 "'.'требует имя структуры или смеси".
      Выражение перед оператором выбора структуры или смеси (.) явля-
      ется указателем на структуру или смесь, а не структурой или
      смесью, как требуется.
C2041 "Ключевое слово 'enum' некорректно".
      В описании структуры или смеси появилось ключевое слово
      'enum', либо определение типа 'enum' было сформировано некор-
      ректно.
C2042 "ключевые слова signed/unsigned является взаимо-исключающими".
      Оба ключевых слова signed и unsigned были одновременно исполь-
      зованы в одном описании, как в следующем примере:
           unsigned signed int i;
C2043 "Некорректный оператор break".
      Оператор break разрешен только внутри операторов do, for, while
      или switch.
C2044 "Некорректный оператор continue".
      Оператор continue разрешен только внутри операторо do, for, или
      while.
C2045 "'identifier': повторное определение метки".
      Данная метка появилась перед более, чем одним оператором в од-
      ной и той же функции.
C2046 "Некорректное ключевое слово case".
      Ключевое слово case может находиться только внутри оператора
      switch.
C2047 "Некорректное ключевое слово default".
      Ключевое слово default может находиться только внутри оператора
      switch.
C2048 "Более одного default".
      Оператор switch содержит более одной метки default.
C2050 "Не целое выражение switch".
      Выражение switch не является целым.
C2051 "Выражение case не константное".
      Выражения case должны быть целыми константами.
C2052 "Выражение case не является целым".
      Выражения case должны быть целыми константами.
C2054 "Значение case 'number' уже было использовано".
      Данное значение case уже было использовано в операторе switch.
C2054 "Требуется знак '(' после идентификатора 'identifier'".
      По контексту требуются скобки после функции 'identifier'.
C2055 "Требуется список формальных параметров, а не тип list".
      В определении функции вместо списка формальных параметров поя-
      вился тип аргумента list.
C2056 "Некорректное выражение".
      Из-за предыдущей ошибки выражение является некорректным (Пре-
      дыдущая ошибка могла не вызвать ошибочного сообщения).
C2057 "Требуется константное выражение".
      По контексту требуется константное выражение.
C2058 "Константное выражение не является целым".
      По контексту требуется целое константное выражение.
C2059 "Синтаксическая ошибка: 'token'".
      Данная лексема вызвала синтаксическую ошибку.
C2060 "Синтаксическая ошибка: EOF".
      Был обнаружен неожиданный конец файла, что вызвало синтак-
      сическую ошибку. Данная ошибка может быть вызвана опущенной зак
      рывающей скобкой '}' в конце вашей программы.
C2061 "Синтаксическая ошибка: идентификатор 'identifier'".
      Данный идентификатор вызвал синтаксическую ошибку.
C2062 "Тип 'type' не требуется".
      Данный тип был некорректно употреблен.
C2063 "'identifier': не является функцией".
      Данный идентификатор не объявлен как функция, но сделана попы-
      тка использовать его в качестве функции.
C2064 "Данный терм не вычисляется в функцию".
      Сделана попытка вызова функции с помощью выражения, которое при
      вычислении не дает указатель функции.
C2065 "'identifier': не определен".
      Данный идентификатор не определен.
C2066 "Преобразование к функции некорректно".
      Объект был преобразован к типу функции.
C2067 "Преобразование к типу массива некорректно".
      Объект был преобразован к типу массива.
C2068 "Некорректное приведение типов".
      Тип, используемый в приведении типов, не является корректным.
C2069 "Приведение типа void к типу, не являющемуся void".
      Тип void был приведен к другому типу.
C2070 "Некорректный операнд sizeof".
      Операнд выражения sizeof не является идентификатором, либо наи-
      менованием типа.
C2071 "'class': неверный класс памяти".
      Данный класс памяти не может быть использован в таком контекс-
      те.
C2072 "'identifier': инициализация функции".
      Была сделана попытка инициализации функции.
C2073 "'identifier': невозможно инициализировать массив в функции".
      Была сделана попытка проинициализировать данный массив внутри
      функции. Массив можно поринициализировать только на внешнем
      уровне.
C2074 "В функции запрещено инициализировать структуру или смесь".
      Была сделана попытка проинициализировать данную структуру или
      смесь внутри функции. Структуры и функции могут быть проинициа-
      лизированы только на внешнем уровне.
C2075 "'identifier': инициализация массива требует только фигурных
      скобок".
      При инициализации массива были пропущены фигурные скобки {}.
C2076 "'identifier': инициализация структуры или смеси требует только
      фигурных скобок".
      При инициализации структуры или смеси были пропущены фигурные
      скобки {}.
C2077 "Нецелый инициализатор поля 'identifier'".
      Была сделана попытка инициализации члена структуры-битового по-
      ля нецелым значением.
C2078 "Слишком много инициализаторов".
      Количество инициализаторов превышает количество инициализируе-
      мых объектов.
C2079 "'identifier'-неопределенная структура или смесь".
      Данный идентификатор был описан, как структура или смесь, тип
      которой не определен.
C2082 "Повторное определение формального параметра 'identifier'".
      Формальный параметр функции был повторно описан в теле функции.
C2083 "Массив 'identifier' уже имеет размер".
      Размерность для данного массива уже была описана.
C2084 "Функция 'identifier' уже имеет тело".
      Данная функция уже была определена.
C2085 "'identifier': не в списке формальных параметров".
      Данный параметр был объявлен в определении функции для несущес-
      твующего формального параметра.
C2086 "'identifier': переопределение".
      Данный идентификатор был определен более одного раза.
C2087 "'identifier': пропущенный описатель".
      В определении массива с несколькими описателями было опущено
      значение описателя для размерности, отличной от первой, как в
      следующем примере:
      int func(a)
          char a[10][]; /* некорректно */
          {
          .
          .
          .
          }
      int func(a)
          char a[][5]; /* корректно */
          {
          .
          .
          .
          }
C2088 "Использование неопределенного идентификатора 'identifier' пе-
      речисления/структуры/смеси".
      Данный идентификатор обращается к структуре или смеси, тип ко-
      торой не определен.
C2089 "typedef определяет функцию near/far".
      Использование ключевых слов near или far в объявлении typedef
      не согласуется с использованием ключевых слов  near или far для
      объявленного элемента, как в следующем примере.
      typedef int far FARFUNC();
      FARFUNC near *fp;
C2090 "Функция возвращает массив".
      Функция не может возвращать массив (она может возвращать только
      указатель на массив).
C2091 "Функция возвращает функцию".
      Функция не может возвращать функцию (она может возвращать толь-
      ко указатель на функцию).
C2092 "Элемент массива не может быть функцией".
      Массивы функций не разрешаются; однако, можно использовать мас-
      сивы указателй на функции.
C2093 "Невозможно инициализировать статические данные или структуры
      адресами автоматических переменных".
C2098 "Не-адресное выражение".
      Была сделана попытка инициализации элемента данных, не являю-
      щегося адресным выражением.
C2099 "Неконстантное смещение".
      Инициализатор использовал неконстантное смещение.
C2100 "Некорректное использование оператора (*)".
      Оператор (*) был применен к неуказателю.
C2101 "'&' в константе".
      Оператор (&) не имеет адресного значения в качестве операнда.
C2102 "'&' требуется адресное значение".
      Оператор адресации (&) должен применяться к адресному значению.
C2103 "'&' в регистровой переменной".
      Была сделана попытка взять адрес регистровой переменной.
C2104 "'&' в битовом поле".
      Была сделана попытка взять адрес битового поля.
C2105 "'operator' требует адресного значения".
      Данный оператор не имеет адресного операнда.
C2106 "'operator': левый операнд должен быть адресным".
      Левый операнд данного оператора не является адресным.
C2107 "Некорректный индекс, косвенное наименование (*) не разрешено".
      Описатель был применен к выражению, которое не вычисляется в
      указатель.
C2108 "Не-целый индекс".
      В качестве описателя массива было использовано не-целое выраже-
      ние.
C2109 "Описатель в не-массиве".
      Описатель был использован в переменной, которая не является
      массивом.
C2110 "'+': 2 указателя".
      Была сделана попытка сложить один указатель с другим.
C2111 "Указатель + не-целое значение".
      Была сделана попытка сложить не-целое значение с указателем.
C2112 "Некорректное вычитание указателей".
      Была сделана попытка вычесть указатели, не указывающие на один
      и тот же тип.
C2113"'-': правый операнд-указатель".
      Правый операнд в операции вычитания (-) является указателем, а
      левый операнд-нет.
C2114 "'operator': указатель слева; требуется целое справа".
      Левый операнд в данном операторе является указателем; правый
      операнд должен быть целым значением.
C2115 "'identifier': несовместимые типы".
      Выражение содержит несовместимые типы.
C2116 "'operator': неправильный левый (или правый) операнд".
      Заданный операнд данного оператора не соответствует данному
      оператору.
C2117 "'operator': Некорректно для структуры или смеси".
      Значение структуры и смеси не разрешено с данным оператором.
C2118 "Отрицательный описатель".
      Значение, определяющее размер массива, -отрицательно.
C2119 "'typedefs' оба определяют косвенное наименование (*)".
      Были использованы одновременно два типа typedef для объявления
      элемента данных и оба типа typedef имеют косвенное наимено-
      вание. Например, объявление p в следующем примере-некорректно:
      typedef int *P INT;
      typedef short *P SHORT;
      /* данное объявление некорректно */
      P SHORT P INT P;
C2120 "'void'-некорректно со всеми типами".
      Тип void был использован в объявлении с другим типом.
C2121 "typedef определяет другое перечисление".
      Была попытка использовать тип, объявленный в операторе typedef
      для задания, как типа перечисления, так и другого типа.
C2122 "typedef определяет другую структуру".
      Была сделана попытка использовать тип, объявленный в операторе
      typedef, для задания как типа структуры, так и другого типа.
C2123 "typedef определяет другую смесь".
      Была сделана попытка использовать тип, объявленный в операторе
      typedef, для задания как типа смеси, так и другого типа.
C2125 "'idetifier': память, занятая данными, превышает 64К":
      Данный элемент данных превышает предельный размер 64К.
C2126 "'identifier': данные типа automatic превышают размер 32К".
      Память, занятая локальными переменными функции, превышает зада-
      нный предел.
C2127 "Память, занятая параметрами, превышает 32К".
      Память, требуемая для парметров функции превышает предел 32К.
C2129 "Статическая функция 'identifier' не найдена".
      Была сделана ссылка на статическую функцию, которая никогда не
      была определена.
C2130 "#line требуется строка, содержащая имя файла".
      В директиве #line было опущено имя файла.
C2131 "Атрибуты near/far/huge заданы более одного раза".
      Ключевые слова near и far были применены к элементу данных бо-
      лее одного раза, как в следующем примере:
      typedef int near NINT;
      NINT far a; /* некорректно */
C2132 "Синтаксическая ошибка: неожиданный идентификатор".
      Идентификатор появлился в синтаксически некорректном формате.
C2133 "Массив 'identifier': неизвестный размер"
      Была сделана попытка описать массив с неназначенным размером,
      как в следующем примере:
      int mat add(array1)
          int array1[]; /* корректно */
          {
          int array2[]; /* некорректно */
          .
          .
          .
          }

C2134 "'identifier': структура или смесь слишком велики".
      Размер структуры или смеси превышает предел, установленный ком-
      пилятором (232 байтов).
C2135 "Пропущен знак ')' в макро-расширении".
      В обращении к макрокоманде с аргументами была опущена закрыва-
      ющая скобка.
C2137 "Пустая символьная константа".
      Была использована некорректная пустая символьная константа
      (' ').
C2138 "Несоответствие закрывающей границы комментария '/*'".
      Компилятор обнаружил открывающий ограничитель комментария (/*)
      без соответствующего закрывающего ограничителя (*/).
      Данная ошибка может возникнуть из-за попытки использования не-
      корректных вложенных коментариев.
C2139 "Тип, за которым следует 'type', некорректен".
      Некорректная комбинация типов, как в следующем примере:
      long char a;
C2140 "Тип аргумента не может быть функцией, возвращающей ...".
      Функция была объявлена, как формальный параметр другой функ-
      ции, как в следующем примере:
      int funcl (a)
          int a(); /* некорректно */
C2141 "Для константы перечисления значение превышает допустимые пре-
      делы".
      Константа перечисления имеет значение, превышающее допустимые
      пределы для типа int.
C2142 "Для многоточия требуется три точки".
      Компилятор обнаружил лексему, содержащую две точки (..) и пред-
C2143 "Синтаксическая ошибка: недостает лексемы 'token1' перед лексе-
      мой 'token2'".
      Компилятор ожидает появления перед token2-token1. Данное сооб-
      щение может появиться, если пропущена требуемая закрывающая фи-
      гурная скобка (}), правая скобка ()) либо точка с запятой (;).
C2144 "Синтаксическая ошибка: недостает лексемы 'token' перед типом
      'type'".
      Компилятор требует наличия данной лексемы перед данным типом.
      Данное сообщение может появиться пре пропущенной закрывающей
      фигурной скобке (}), правой скобке ()), или точке с запятой
      (;).
C2145 "Синтаксическая ошибка: перед идентификатором не хватает лексе-
      мы 'token'".
      Компилятор требует наличия перед идентификатором данной лексе-
      мы. Данное сообщение может появиться при пропущенной точке с
      запятой (;) в последнем объявлении блока.
C2146 "Синтаксическая ошибка: перед идентификатором 'identifier' не
      хватает лексемы 'token'".
      Компилятор требует наличия данной лексемы перед данным иденти-
      фикатором.
C2147 "Массив: неизвестный размер".
      Сделана попытка увеличить индекс, либо указатель на массив, ба-
      зовый тип которого еще не объявлен.
C2148 "Слишком большой массив".
      Массив превышает максимально-допустимый размер (232 байта).
C2149 "'identifier': данное битовое поле не может иметь нулевую шири-
      ну".
      Битовое поле с данным именем имеет нулевую ширину. Нулевой раз-
      мер разрешается иметь только неименованным битовым полям.
C2150"'identifier': битовое поле должно иметь тип int, signed int или
      unsigned int.
      Стандарт ANSI C требует, чтобы битовые поля имели типы int,
      signed int или unsigned int. Данное сообщение может появиться
      только при компиляции с опцией /Za.
C2151 "Задано более одного атрибута cdecl/fortran/pascal".
      Было задано более одного ключевого слова, определяющего согла-
      щения о вызове функций.
C2152 "'identifier': указатели на функции с различными атрибутами".
      Была сделана попытка присвоить указатель на функцию, объявлен-
      ную с одними соглашениями о связях (cdecl, fortran или pascal)-
      -указателю на функцию, объявленную с другими соглашениями о
      связях.
C2153 "Шестнадцатеричные константы должны иметь по крайней мере одну
      шестнадцатеричную цифру".
      Ox или OX-являются некорректными шестнадцатеричными константа-
      ми. За "x" или "X" должна следовать хотя бы одна шестнадца-
      теричная цифра.
C2154 "'name': не относится к сегменту".
      Имя функции name было первым идентификатором, заданным в аргу-
      ментном списке прагмы alloc_text, и уже определено как какое-
      -либо имя, отличное от имени сегмента.
C2155 "Имя 'name': уже имеется в сегменте".
      Имя функции name появляется более, чем в одной прагме alloc_
      text.
C2156 "Прагма должна быть на внешнем уровне".
      Некоторые прагмы должны быть определены на глобальном уровне,
      вне тела функции, а одна из таких прагм оказалась внутри фун-
      кции.
C2157 "'name': перед использованием в списке прагмы данное имя долж-
      но быть описано".
      Данное имя функции из списка функций прагмы alloc_text не было
      описано перед включением в список.
C2158 "'name': является функцией".
      Имя name было задано в списке переменных прагмы same_seg, но
      ранее было объявлено, как функция.
C2159 "Определено  более одного класса памяти".
      В описании было задано более одного класса памяти, как в сле-
      дующем примере:
      extern static int i;
C2160 "## не может встретиться в начале макро-определения".
      Макро-определение начинается с оператора подстановки лексем,
      как в следующем примере:
      #define mac(a,b) ##a...
C2161 "## не может находиться в конце макро-определения".
      Макро-определение заканчивается оператором подстановки лексем
      (##).
C2162 "Требуется формальный параметр макрокоманды".
      Лексема, следующая за оператором (#), не является именем фор-
      мального параметра, как в следующем примере:
      #Define print(a) printf(#b)
C2163"'string': отсутствует, как intrinsic".
      Функция, определенная в списке функций для прагмы intrinsic или
      function, не является одной из имеющихся в форме intrinsic фун-
      кций.
C2165 "'keyword': невозможно изменить указатели на данные".
      Были некорректно использованы ключевые слова fortran, pascal
      или cdecl для модификации указателя на данные, как в следующем
      примере:
      char pascal *p;
C2166 "Значение определяет объект, относящийся к классу памяти
      'const'".
      Была сделана попытка присвоить значение элементу данных, объяв-
      ленному с классом памяти const.
C2167 "'name': слишком много фактических параметров для intrinsic.
      Ссылка на имя intrinsic function содержит слишком много факти-
      ческих параметров.
C2168 "'name': слишком мало фактических параметров для intrinsic".
      Ссылка на имя содержит слишком мало фактических параметров.
C2169 "'name': является intrinsic оно не может быть определено ".
      Была сделана попытка задать определение для функции, уже описа-
      нной, как intrinsic.
C2171 "'operator': неверный операнд".
      Данный унарный оператор был использован с операндом некоррект-
      ного типа, как в следующем примере:
      int (*fp)();
      double d, d1;
        .
        .
        .
      fp++;
      d=~d1
C2172 "'function': фактически не указатель, параметр номер'number'.
      Была сделана попытка передать аргумент, не являющийся указате-
      лем, функции, требующей указатель. Данный номер указывает, ка-
      кой аргумент ошибочен.
C2173 "'function': фактически не указатель, параметр 'number': спи-
      сок параметров 'number'".
      Была сделана попытка передать аргумент, не являющийся указате-
      лем, функции, требующей указатель. Данная ошибка может произой-
      ти в вызовах, возвращающих указатель на функцию. Первый номер
      указывает, какой аргумент вызвал ошибку; второй номер показы-
      вает, какой список аргументов содержит неверный аргумент.
C2174 "'function': фактически имеет тип void: параметр 'number', спи-
      сок параметров 'number'".
      Была сделана попытка передать аргумент типа void функции. Фор-
      мальные параметры и аргументы функции не могут иметь тип void;
      однако, они могут иметь тип void* (указатель на void). Данная
      ошибка происходит в вызовах, возвращающих указатель на функцию.
      Первый номер показывает, какой аргумент вызвал ошибку; второй
      номер показывает, какой список аргументов содержит неправильный
      аргумент.
C2175 "'function': неразрешенная внешняя ссылка".
      Данная функция неопределена в исходном файле, либо встроена в
      среду программирования QUICK-C, либо находится в библиотеке
      QUICK, если она загружена.
      Данная ошибка возникает только в одно-модульных, встроенных в
      среду Quick-C программах. Чтобы разрешить данную проблему, либо
      определите функцию в исходном файле, либо загрузите библиотеку
      QUICK,содержащую данную функцию, либо (если функция содержится
      в стандартной библиотеке СИ-функций), создайте для программы
      программный список.
C2177 "Константа слишком велика".
      Информация была потеряна, поскольку константа слишком велика,
      чтобы заменить тип, которому она присваевается. (1)

D.1.3. Предупреждающие сообщения.

Сообщения, перечисленные в данном разделе, вскрывают некоторые возможные проблемы, но не мешают компиляции и компановке. Номер в скобках в конце сообщения об ошибке означает минимальный уровень предупреждения, установленный для данного сообщения.

Номер  Предупреждающее сообщение


C4000 "Нераспознанное предупреждение, свяжитесь с техническим сер-
      висом фирмы Microsoft".
      Компилятор обнаружил неизвестную ошибку. Пожалуйста, сообщите
      условия возникновения данной ошибке фирме Microsoft Corpora-
      tion, воспользовавшись бланком "Product Assistant Request",
      находящимся в конце данного руководства.
C4001 "Макрокоманда 'identifier'требует параметров".
      Данный идентификатор был определен, как макрокоманда, имеющая
      один или более аргументов, но используется в программе без ар-
      гументов. (1).
C4002 "Слишком много фактических параметров для макрокоманды 'identi-
      fier'".
      Число фактических аргументов, употребляемых с данным идентифи-
      катором, больше, чем число формальных параметров, заданных в
      макроопределении данного идентификатора. (1).
C4003 "Не достаточно фактических параметров для макрокоманды
      'identifier'".
      Число фактических аргументов, употребляемых с данным идентифи-
      катором, меньше, чем число формальных параметров, заданных в
      макроопределении данного идентификатора. (1).
C4004 "Не хватает закрывающей скобки после 'defined'".
      После фразы #if defined пропущена закрывающая скобка. (1).
C4005 "'identifier': повторное определение".
      Данный идентификатор был повторно определен. (1).
C4006 "Директиве #indef требуется идентификатор".
      В директиве #indef задан идентификатор, определение которого
      отсутствет. (1).
C4009 "Строка слишком велика, хвостовые символы отсекаются".
      Размер строки превышает предел, установленный компилятором.
      Для исправления данной ситуации разбейте строку на две или бо-
      лее подстроки. (1).
C4011 "Идентификатор усечен до 'identifier'".
      Принимаются только первые 31 символ идентификатора. (1).
C4014 "'identifier': битовое поле должно иметь тип unsigned.
      Данное битовое поле не было описано с типом unsigned. Битовые
      поля должны быть описаны, как целые без знака. Компилятор со-
      ответственно конвертирует данное битовое поле. (1).
C4014 "'identifier': битовое поле должно иметь целый тип".
      Данное битовое поле было описано, не как целое. Битовые поля
      должны быть описаны, как целые без знака. Было применено пре-
      образование. (1).
C4016 "'identifier': нет типа, возвращаемого функцией".
      Данная функция еще не была описана либо определена, поэтому
      тип возвращаемого значения неизвестен.
      Подразумевается стандартный тип (int). (2).
C4017 "Приведение целого выражения к 'дальнему' указателю".
      Дальние указатели содержат полные адреса сегментов. На процес-
      соре 8086/8088 приведение целого (int) значения к "дальнему"
      указателю может создать адрес с бессмысленным значением сегмен-
      та. (1).
C4020 "Слишком много фактических параметров".
      Число аргументов, определенных в вызове функции, больше числа
      формальных аргументов, заданных в списке аргументов определения
      функции. (1).
C4021 "Слишком мало фактических параметров".
      Число аргументов, заданных в вызове функции, меньше числа фор-
      мальных параметров, определенных в списке аргументов определе-
      ния функции. (1).
C4022 "Несоответствие указателей: параметр n".
      Тип указателя данного параметра отличен от типа указателя, за-
      данного в списке аргументов определения функции. (1).
C4024 "Различные типы: параметр n".
      Тип данного параметра функции не согласуется с типом, заданным
      в списке аргументов определения функции. (1).
C4025 "Описание функции задает переменный список аргументов".
      Список типов аргументов определения функции заканчивается запя-
      той, за которой следует многоточие, что  означает, что функция
      может принимать переменное число аргументов, но для функции не
      были описаны формальные параметры. (1).
C4026 "Функция была описана со списком формальных параметров".
      Функция была описана, как принимающая аргументы, но в определе-
      нии функции не задано формальных параметров. (1).
C4027 "Функция была описана без списка формальных параметров".
      Функция была описана, как не принимающая аргументов (список
      типов аргументов состоит из слова void), но в определении функ-
      ции заданы формальные параметры, либо в вызове функции заданы
      фактические параметры. (1).
C4028 "Отличается описание параметра n".
      Тип данного параметра не согласуется с соответствующим типом в
      списке типов аргументов, либо с соответствующим формальным па-
      раметром. (1).
C4029 "Описание списка параметров отлично от определения":
      Список типов аргументов, заданный в описании функции, не со-
      гласуется с типами формальных параметров, заданных в опреде-
      лении функции. (1).
C4030 "Первый список параметров длиннее второго".
      Функция была описана более одного раза, причем с различными
      списками типов аргументов. (1).
C4031 "Второй список параметров длиннее, чем первый".
      Функция была описана более одного раза, причем с различными
      списками типов аргументов. (1).
C4032 "Неименованная структура/смесь в качестве параметра".
      Тип структуры или смеси был передан как неименованный аргумент,
      то есть описание формального параметра не может использовать
      имя и должно описать тип. (1).
C4033 "Функция должна возвращать значение".
      Если функция не описана, как void, она должна возвращать зна-
      чение. (2).
C4034 "Оператор sizeof возвратил 0".
      Оператор sizeof был применен к операнду, причем в результате
      был получен 0. (1).
C4035 "'identifier': нет возвращаемого значения".
      Функция описана, как возвращающая значение, но не делает
      этого. (2).
C4036 "Не ожидаемый список формальных параметров".
      Список формальных параметров был задан в описании функции.
      Список формальных параметров игнорируется. (1).
C4037 "'identifier': формальные параметры игнорируются".
      В описании функции не найдено перед описанием формальных
      параметров ни класса памяти, ни наименование типа, как в сле-
      дующем примере:
         int * f(a,b,c);
      Формальные параметры игнорируются. (1).
C4038 "'identifier':формальный параметр имеет некорректный класс па-
      мяти".
      Данный формальный параметр был описан с классом памяти, от-
      личным от auto или register. (1).
C4039 "'identifier': функция используется в качестве аргумента"
      Формальный параметр функции был описан, как функция, что не-
      корректно.Формальный параметр будет преобразован в указатель
      функции (1).
C4040 "Ключевое слово near/far/ в идентификаторе 'identifier' игнори-
      руется".
      Ключевые слова near или far не оказывают никакого действия на
      данный идентификатор и потому игнорируются.(1).
C4041 "Формальный параметр 'identifier' переопределен".
      Данный формальный параметр был в теле функции определен повтор-
      но, сделав соответствующий фактический параметр для функции не-
      доступным. (1).
C4042 "'identifier' имеет не корректный класс памяти".
      Заданный класс памяти не может быть использован в данном конте-
      ксте (например, параметрам функции не может быть присвоен класс
      extern). Для данного контекста использован вместо некорректного
      стандартный класс памяти. (1).
C4043 "'identifier': тип void изменен на int".
      Элемент данных, отличный от функции, был описан с типом void.
      (1).
C4045 "'identifier': массив переполнен".
      Для данного массива было задано слишком много инициализаторов.
      Лишние инициализаторы будут игнорированы. (1).
C4046 "Знак '&' в функции/массиве игнорируется".
      Была сделана попытка применить оператор адресации (&) к иден-
      тификатору, обозначающему функцию или массив. (1).
C4047 "'operator': различные уровни косвенного наименования".
      Данную ситуацию иллюстрирует следующий пример:
      char **p;
      char *q;
      .
      .
      .
      p=q;
C4048 "Массив описан с помощью различных описателей".
      Массив был описан дважды с различными размерами. Используется
      большой размер. (1).
C4049"'operator': косвенное наименование применяется к различным ти-
      пам".
      Оператор косвенного наименования (*) был использован в выраже-
      нии для доступа к значениям различных типов. (1).
C4051 "Преобразование данных".
      В выражении два элемента данных имеют различные типы, что при-
      ведет к преобразованию данных к одному типу. (2).
C4052 "Различные типы enum".
      В выражении были использованы два различных типа enum. (1).
C4053 "По крайней мере один операнд void"
      Выражение с типом void было использовано в качестве операнда.
      (1).
C4056 "Переполнение в константной арифметике".
      Результат операции превышает 0x7FFFFFFF. (1).
C4057 "Переполнение при перемножении констант".
      Результат операции превышает 0x7FFFFFFF. (1).
C4058 "Взят адрес переменной фрейма, DS!=SS".
      Программа была скомпилирована со стандартным сегментом данных
      (DS), не равным стэковому сегменту (SS), программа пытается об-
      ратиться к переменной фрейма посредством ближнего указателя.(1)
C4059 "В результате преобразования адрес сегмента потерян".
      Преобразование "дальнего" указателя (полного адреса сегмента) к
      "ближнему" указателю (смещение) привело к потере адреса сегмен-
      та. (1).
C4060 "Преобразование 'длинного' адреса в 'короткий' адрес".
      Преобразование длинного адреса (32-разрядного указателя) в ко-
      роткий адрес (16-разрядного указателя) привело к потере адреса
      сегмента. (1).
C4061 "long/short несоответствие в аргументе: применено преобразо-
      вание".
      Базовые типы действительных и формальных параметров функции
      различны. Фактический параметр преобразовывается к типу фор-
      мального параметра. (1)
C4063 "'identifier': функция слишком велика для шага оптимизации".
      Данная функция не была оптимизирована, поскольку для этого
      недостаточно памяти. Чтобы исправить данную ситуацию, сократи-
      те размер функции путем разделения ее на две или более меньших
      функций. (0).
C4066 "Таблица локальных имен переполнена-некоторые локальные имена
      могут быть пропущены в списке".
      Генератор листинга вышел за пределы динамической области, отве-
      денной под локальные переменные, поэтому исходный листинг может
      не включать в себя полную таблицу имен для всех локальных пере-
      менных
C4067 "За директивой 'directive' следуют непонятные символы-требует-
      ся символ перехода на следующю строку".
      За директивой препроцессора следуют лишние символы, как в
      следующем примере:
      #endif NO_EXT_KEYS
      Это принимается в некоторых версиях компилятора Microsoft C,
      исключая версию 1.0 Microsoft Quick C. (1).
C4068 "Неизвестная прагма".
      Компилятор не смог распознать прагму и игнорировал ее. (1).
C4069 "Преобразование ближнего указателя к длинному целому".
      Ближний указатель был преобразован к длинному целому, что за-
      полнило старшие разряды текущим значением сегмента данных, не
      равным нулю. (1).
C4071 "'identifier': прототип функции не задан".
      Данная функция была вызвана компилятором перед тем, как компи-
      лятор обработал соответствующий прототип функции. (3).
C4072 "Недостаточно памяти для обработки отладочной информации".
      Вы скомпилировали программу с опцией /Zi, но для создания со-
      ответствующей отладочной информации недостаточно памяти. (1).
C4073 "Вложенность слишком глубока, дальнейшая вложенность во время
      отладки игнорируется".
      Описания появились на уровне вложенности, большем 13. В ре-
      зультате, все описания будут восприниматься как бы на одном
      уровне. (1).
C4074 "Было использовано нестандартное расширение-'extension'".
      Было использовано данное нестандартное расширение в то время,
      как опция Language Extension в диалоговой рамке Compile была
      выключена, либо опция /Ze не действовала. Данные расширения да-
      ны в Разделе 8.1.4.6. "Использование расширений языка СИ фирмы
      Microsoft: Опция Language Extension". (если включена опция /Za,
      данная ситуация дает ошибку). (3).
C4075 "Размер выражения в операторе switch или константа в операторе
      case имеют слишком большой размер-преобразуются к типу int".
      Значение, появляющееся в операторах switch или case, больше ти-
      па int. Компилятор преобразует данное некорректное значение в
      тип int. (1).
C4076 "'type': может быть использовано только с целыми типами".
      Модификатор типа signed или unsigned был применен к не целому
      типу, как в следующем примере:
      unsigned double b;
C4077 "Неизвестная опция прагмы check_stack".
      Со старой формой прагмы check_stack была задана неизвестная
      опция, как в следующем примере:
      #pragma check_stack yes
      В старой форме прагмы check_stack аргумент прагмы должен быть
      пустым + или -.
C4079 "Неожиданный символ 'character'".
      В аргументном списке прагмы был найден неожиданный разделитель
      'character'".
C4080 "Пропущено имя сегмента".
      В первом аргументе аргументного списка прагмы alloc_text про-
      пущено имя сегмента. Это случается, если первая лексема в ар-
      гументном списке не является идентификатором.
C4082 "Требуется идентификатор".
      В списке аргументов прагмы пропущен идентификатор.
C4083 "Пропущено'('".
      В аргументном списке прагмы пропущена открывающая левая скобка,
      как в следующем примере:
      #pragma check_pointer on)
C4084 "Требуется ключевое слово pragma".
      Лексема, следующая за ключевым словом pragma, не является иден-
      тификатором, как в следующем примере:
      #pragma (on)
C4085 "Требуется [on/off]
      Для новой формы прагмы check_stack был задан некорректный аргу-
      мент, как в следующем примере:
      #pragma check_stack (yes)
C4087 "'name': описана с пустым списком параметров".
      Данная функция была описана, как не принимающая параметров, в
      то время как вызов функции определяет фактические параметры,
      как в следующем примере:
      int fl(void);
         .
         .
         .
      fl(10);
C4090 "Различные атрибуты 'const'".
      Указатель на элемент данных, описанный, как const, был пере-
      дан функции, соответствующий формальный параметр которой явля-
      ется указателем на элемент данных, не являющийся const. Это
      значит, что данный элемент данных может быть незаметно изме-
      нен, как в следующем примере:
      const char *p = "ascde";
      int str(char *s);
         .
         .
         .
      str(p);
C4091 "Не описано никаких имен".
      Компилятор обнаружил пустое описание, как в следующем примере
      (2):
      int;
C4092 "Описание перечисления/структуры/смеси не имеет имени".
      Компилятор обнаружил пустое описание, использующее не имеющую
      соответствующего тэга структуру, смесь или перечисление, как в
      следующем примере:
      struct {
         .
         .
         .
              };
C4093 "Некорректный символ перехода на новую строку в символьной кон-
      танте в не действующем коде".
      Константное выражение в директиве препроцессора #if, #ifdef или
      #ifndef вычисляется в 0, что делает соответствующий код неактив
      ным, причем символ перехода на новую строку появляется в данном
      не активном коде между соответствующими одиночными или двойными
      кавычками.
C4095 "Слишком много аргументов для прагмы".
      В прагме, имеющей только один аргумент, появляется более одного
      аргумента.
C4096 "Элемент типа huge трактуется, как far".
      Поскольку компилятор Microsoft Quick-C не поддерживает ключевое
      слово huge, элемент данных трактуется, как описанный с ключе-
      вым словом far. Если элемент данных или функция должны все же
      иметь тип huge, перекомпилируйте программу с помощью Оптимизиру
      ющего компилятора Microsoft C.
C4097 "В строке встретился символ 'hex-character', не относящийся к
      коду ASCII".
      Данный не ASCII-символ был использован в данной символьной
      строке.

D.1.4. Ограничения компилятора.

Для работы с компилятором Microsoft Quick-C вам нужно иметь достаточное количество памяти для обработки временных файлов, используемых для обработки. Требуется память приблизительно в два раза большая, чем размер исходного файла.

В таблице D.1 приводятся ограничения,накладываемые СИ-компиля- тором. Если ваша программа превышает один из заданных пределов, вас информирует об этом сообщение об ошибке.

                                                 Таблица D.1.
                      Ограничения СИ-компилятора.

Элемент программы      Описание                  Ограничения


Строковые литералы     Максимальная длина строки, 512 байтов
                       включающая нулевое оконча-
                       ние ().
Константы              Максимальный размер констан-
                       ты зависит от ее типа; смот-
                       рите "Справочное руководство
                       по языку СИ".
Идентификаторы         Максимальная длина идентифи- 31 байт (дополни-
                       катора                       тельные символы
                                                    не воспринимают-
                                                    ся).
Описания               Максимальный уровень вло-    10 уровней
                       женности для определений
                       структуры или смеси.
Директивы препроцес-   Максимальный размер макро-   512 байтов.
сора                   определения.
                       Максимальное количество      8 аргументов
                       фактических параметров в
                       макроопределении.
                       Максимальная длина реально-   256 байтов
                       го аргумента препроцессора.
                       Максимальный уровень вложен-  32 уровня
                       ности директив #if, #ifdef,
                       #ifndef.
                       Максимальный уровень вложен-  10 уровней
                       ности для подключаемых фай-
                       лов.

Компилятор не устанавливает явные ограничения на число и сложность описаний, определений и операторов в отдельных функциях или в программе. Если компилятор встречает функцию или программу слишком большую или слишком сложную для обработки, он выводит сообщение об ошибке.

D.2.Сообщения об ошибках в командной строке.

Сообщения, указывающие на ошибки в командной строке, используемой для вызова компилятора, имеют один из следующих форматов:

command line fatal error D1xxx: messagetext          Fatal error
(Фатальная ошибка командной строки D1xxx: текст сообщения Фатальная
ошибка)

command line error D2xxx: messagetext                 Error
(Ошибка командной строки D2xxx: текст сообщения       Ошибка)

command line warning D4xxx: messagetext               Warning
(Предупреждение командной строки D4xxx: текст сообщения
Предупреждение).

Если возможно, компилятор продолжает работу, распечатывая предупреждающее сообщение. В некоторых случаях ошибки командной строки являются неисправимыми и компилятор прекращает работу. Сообщения, приведенные в разделах D.2.1-D.2.3 описывают ошибки командной строки.

D.2.1. Неисправимые ошибки командной строки.

Следующие сообщения описывают фатальные ошибки. Драйвер компилятора не может восстановить работу после фатальной ошибки; он прекращает работу после распечатки сообщения.

Номер   Сообщение о фатальной ошибке в командной строке

D1000 Неизвестная фтатальная ошибка командной строки. Свяжитесь с тех
      нической службой фирмы Microsoft. Компилятор обнаружил нераспоз
      нанную неисправимую ошибку.
      Пожалуйста, сообщите условия возникновения данной ошибки в фир-
      му Microsoft Corporation с помощью формы Product Assistance
      Request, находящейся в конце данного руководства.
D1001 "Невозможно выполнить 'filename'".
      Компилятор не может найти данный файл в текущем рабочем катало-
      ге, либо в других каталогах, определяемых посредством перемен-
      ной PATH.
D1002 "Слишком много открытых файлов, невозможно переадресовать
      'filename'".
      Больше нет файлов, чтобы переадресовать вывод опции /P в файл.
      Попробуйте изменить ваш файл CONFIG.SYS и увеличьте значение
      num в строке files=num (если num меньше 20).

D.2.2. Сообщения об ошибках командной строки.

Как только драйвер компилятора встречает одну из ошибок, перечисленных в данном разделе, он (если возможно) продолжает компиляцию программы и выводит дополнительные сообщения об ошибках. Однако, объектный файл не строится.

Номер   Сообщение об ошибках командной строки


D2000 "Нераспознанная ошибка командной строки, обратитесь в техничес-
      кий сервис фирмы Microsoft".
      Компилятор обнаружил неизвестную ошибку. Пожалуйста, сообщите
      условия возникновения данной ошибки фирме Microsoft Corporati-
      on, используя бланк "Product assistance Request", находяцийся в
      конце данного руководства.
D2001 "Слишком много имен определены с -D".
      Слишком много символических констант были определены с помощью
      опции /D командной строки.
      Обычный предел определений на командной строке 16; если вы ис-
      пользуете опции /U или /u-предел увеличивается до 20.
D2002 "Предварительно определенная модель была отменена".
      Были определены две различные модели памяти; используется мо-
      дель, заданная на командной строке позже.
D2003 "Пропущено имя исходного файла".
      Вы не задали имя компилируемого исходного файла.
D2007 "Неверно задана опция, следует заменить 'string1' на
      'string2'".
      Данная опция была задана более одного раза с конфликтующими ар-
      гументами string1 и string2.
D2008 "Слишком много флажков опции 'string'".
      С заданной опцией было определено слишком много букв (например,
      с опцией /O).
D2009 "Неизвестный символ опции 'option string'".
      Одна из букв данной опции нераспознана.
D2010 "Неизвестная опция плавающей точки".
      Данная опция плавающей точки ( опция /FP) не является коррект-
      ной.
D2011 "Разрешена только одна опция плавающей точки".
      На командной строке вы задали более одной опции плавающей точ-
      ки (/FP).
D2012 "На командной строке слишком много опций компановщика".
      Вы сделали попытку задать на командной строке более 128 отдель-
      ных опций и объектных файлов для компановщика.
D2015 "Ассемблерные файлы не обрабатываются".
      Вы задали на командной строке имя файла с расширением .ASM.
      Поскольку компилятор не может автоматически вызывать Макроас-
      семблер (MASM), он не может ассемлировать данные файлы.
D2018 "Невозможно открыть файл компановщика cmd".
      Файл соответствий, передающий компановщику имена объектных фай-
      лов и опции, не может быть открыт.
      Данная ошибка может произойти, если какой-либо файл с атрибутом
      "только-чтение" имеет то же самое имя, что файл соответствий
      компановщика.
D2019 "Невозможно перезаписать исходный файл 'name'".
      Вы задали исходный файл в качестве выводного. Компилятор не
      позволяет исходному файлу быть перезаписанным одним из выход-
      ных файлов компилятора.
D2020 "Опция -Gc требует возможности разрешения расширенных ключевых
      слов (-Ze)".
      Опция /Gc и опция /Za были заданы на одной командной строке.
      Опция /Gc требует возможности задания расширенного ключевого
      слова cdecl, если осуществляется доступ к библиотечным функ-
      циям.
D2021 "Неверный числовой аргумент 'string'".
      Нечисловая строка была задана за опцией, требующей  числового
      аргумента.
D2022 "Невозможно открыть файл помощи cl.hlp".
      Была задана опция /HELP, но файл содержащий вспомогательные
      сообщения не был найден в текущем каталоге, либо в каталогах,
      заданных с помощью переменной PATH.

D.2.3. Предупреждающие сообщения командной строки.

Сообщения, перечисленные в данном разделе, описывают возможные проблемы, но не прерывают компиляцию и компановку.

Номер   Предупреждающие сообщения


D4000 "Неизвестное предупреждение командной строки, свяжитесь с тех-
      нической службой фирмы Microsoft".
      Компилятором была обнаружена неизвестная ситуация.
      Пожалуйста, сообщите условия возникновения данной ситуации фир-
      ме Microsoft Corporation, используя бланк "Product Assistance
      Request", находящийся в конце данного руководства.
D4002 "Неизвестная опция 'string' игнорируется".
      Одна из опций, заданных на командной строке, была  нераспоз-
      нана и потому проигнорирована.
D4003 "Для генерации кода выбран 80186/286, а не 8086".
      Были заданы обе опции: /G0 и /G2; преимущество дано опции /G2.
D4004 "Оптимизация по времени, а не по размеру".
      Данное сообщение подтвердило использование для оптимизации оп-
      ции /Ot.
D4005 "Невозможно выполнить 'filename'; пожалуйста, вставьте дискету
      и нажмите любой ключ".
      Команда QCL не может найти заданный выполняемый файл по задан-
      ному маршруту.
D4006 "Разрешена только одна из опций -P/-E/-EP, выбрана -P".
      Было задано более одной выводной опции препроцессора.
D4007 "Опция -C игнорируется (нужно задать также -P или -E, либо
      -EP)".
      Опция /C должна использоваться вместе с одной из выводных
      опций препроцессора (/E, /EP, /P).
D4009 "Порог только для данных far/huge, игнорируется".
      Опция /Gt была использована в модели памяти, имеющей ближние
      указатели на данные. Она может применяться только для ком-
      пактной и большой моделей.
D4010 "Опция -Gp не применяется, игнорируется".
      Версия операционной системы DOS Microsoft C не поддерживает
      профайлинг.
D4013 "Комбинированный листинг имеет преимущество над объектным
      листингом"
      Если опция /Fc задана вместе с одной из опций /Fl или /Fa, соз-
      дается комбинированный листинг (/Fc).
D4014 "Неверное значение number для строки 'string'. Используете ста-
      ндартное значение number".
      В контексте, требующем определенное числовое значение, было за-
      дано некорректное значение.
D4017 "Конфликтующие опции проверки стэка-проверка стека отменяется".
      Вы задали на командной строке CL обе опции /Ge и /Gs. Опция Gs
      имеет преимущество, поэтому в данной программе стэковый конт-
      роль отменяется.

D.3. Сообщения об ошибках периода выполнения.

Ошибки периода выполнения подразделяются на четыре категории: 1.Исключительные ситуации при выполнении операций с плавающей точкой математическим сопроцессором 8087/80287 или эмулятором. Данные ситуации описаны в Разделе D.3.1.

2. Сообщения об ошибках, сгенерированные библиотекой периода выполнения, информирующие вас о серьезных ошибках. Данные сообщения перечислены и описаны в Разделе D.3.2.

3. Сообщения об ошибках, сгенерированные во время обращения к процедурам обработки ошибок библиотеки периода выполнения — abort, assert, perror-как только программа вызовет процедуру. Данная процедура направляет сообщения в стандартный вывод. Описание данных процедур и соответствующих сообщений об ошибках смотрите в документе: «Справочное руководство по библиотеке процедур Microsoft-C».

4. Сообщения об ошибках, сгенерированные вызовами математических процедур из библиотеки СИ периода выполнения. В случае ошибки математические процедуры возвращают ошибочное значение, а некоторые выводят сообщение на стандартной вывод. Описание математических процедур и соответствующие сообщения об ошибках смотрите в документе «Справочное руководство по библиотеке проц Microsoft-C».

D.3.1. Исключительные ситуации операций с плавающей точкой.

Сообщения об ошибках, перечисленные ниже, генерируются математическим сопроцессором 8087/80287. Описание сбоев оборудования смотрите в документации по процессорам семейства Intel. Данные ошибки могут быть также выявлены эмулятором операций с плавающей точкой, встроенным в стандартную библиотеку Quick-C.

С помощью назначений управляющего слова сопроцессора 8087/80287, следующие исключительные ситуации маскируются и потому не происходят Исключительная Стандартное маскирующее действие

ситуация

Слишком малое число    Ситуация маскируется
Потеря значимости      Результат приводится к нулю
Потеря точности        Ситуация маскируется

Информацию о том, как изменить управляющее слово операций с плавающей точкой, смотрите в справочных страницах, посвященных _control87, в документе «Справочное руководство по библиотеке процедур Microsoft C».

Кроме того, следующие ошибки не возникают в коде, сгенерированном с помощью компилятора Microsoft Quick-C или полученном посредством стандартной СИ-библиотеки:

      Квадратный корень
      Выход за нижнюю границу стэка
      Неэмулируется

Исключительные ситуации при операциях с плавающей точкой имеют следующий формат:

      run-time error M61nn: MATH
      - floating-point error: messagetext

Номер Исключительные ситуации при операциях с плавающей точкой

М6101 "Неверно".
      Произошла некорректная операция. Обычно это происходит при дей-
      ствиях с с неопределенностями.
      Данная ошибка приводит к останову программы с кодом завершения
      129.


Номер   Исключительные ситуации при операциях с плавающей точкой


М6102 "Слишком малое число".
      Было сгенерировано слишком малое число с плавающей точкой, даль
      нейшее его использование приведет к потере значимости. Такие
      ситуации обычно маскируются, они отлавливаются и обрабатывают-
      ся. Программа заканчивается с кодом завершения 130.
М6103 "Деление на нуль".
      Была сделана попытка деления на нуль. Программа заканчивается
      с кодом 131.
М6104 "Переполнение".
      При выполнении операции с плавающей точкой произошло переполне-
      ние. Программа заканчивается с кодом 132.
М6105 "Потеря значимости".
      Во времы операции с плавающей точкой произошла потеря значимос-
      ти. Такие ситуации обычно маскируются; слишком малое значение
      заменяется нулем. Программа заканчивается с кодом завершения
      133.
М6106 "Потеря точности".
      Во время операции с плавающей точкой произошла потеря точности.
      Данная ситуация обычно проходит незамеченной, поскольку почти
      все операции с плавающей точкой могут привести к потере точнос-
      ти. Программа заканчивается с кодом 134.
М6107 "Невозможна эмуляция"
      Была сделана попытка выполнить инструкцию сопроцессора 8087/
      /80287, являющуюся некорректной и не поддерживаемую эмулятором.
      Программа завершается с кодом 135.
М6108 "Квадратный корень".
      Операнд операции извлечения квадратного корня отрицателен. Про-
      грамма завершается с кодом 136. (обратите внимание, функция
      sqrt из библиотеки процедур языка СИ проверяет аргумент перед
      выполнением и возвращает ошибку, если аргумент отрицателен;
      описание функции sqrt смотрите в документе: "Справочное руко-
      водствопо библиотеке процедур Microsoft-C":
М6110 "Переполнение стэка".
      Выражение с плавающей точкой привело к переполнению стэка на
      сопроцессоре 8087/80287 или эмуляторе. (ситуации переполнения
      стэка отлавливаются до предела 7 уровней в дополнение к восьми
      уровням, обычно поддерживаемым сопроцессором 8087/80287). Прог-
      рамма завершается с кодом 138.
М6111 "Выход за нижнюю границу стэка".
      Выполнение операции с плавающей точкой на сопроцессоре
      8087/80287 или эмуляторе вызвало выход за нижнюю границу
      стэка. Программа завершается с кодом 139.
М6112 "Явно сгенерирована ошибка".
      Сигнал, означающий ошибку при выполнении операции с плавающей
      точкой, был послан с помощью вызова raise (SIGFPE). Программа
      завершается с кодом 140.

D.3.1. Сообщения об ошибках периода выполнения.

Следующие сообщения описывают ошибки, сгенерированные в процессе выполнения программы. Номера ошибок периода выполнения лежит в пределах от R6000 до R6999.

Сообщения об ошибках периода выполнения имеют следующую основную форму:

    run-time error R6nnn
    - messagetext
    (ошибка периода выполнения R6nnn)
    (- текст сообщения)

Номер Сообщение об ошибке периода выполнения

R6000 "Переполнение стэка".
      Ваша программа переполнила пространство, отведенное под стэк.
      Это может произойти, если ваша программа использует большое
      количество локальных данных или является рекурсивной. Программа
      завершается с кодом 255.
      Чтобы исправить данную ситуацию, перекомпилируйте программу с
      помощью команды QCL с опцией /F и перекомпануйте программу, ис-
      пользуя опцию компановщика /STACK для размещения большого стэка
R6001 "Присваивание нулевого указателя".
      В процессе выполнения программы было изменено содержимое сег-
      мента NULL. Сегмент NULL-это специальное место, расположенное
      по младшим адресам памяти, которое обычно не используется. Ес-
      ли содержимое сегмента NULL изменилось в процессе выполнения
      программы, это означает, что программа была записана на эту об-
      ласть, обычно, из-за примененного по небрежности нулевого ука-
      зателя. Заметим, что ваша программа может содержать нулевые
      указатели, но данное сообщение не будет генерироваться; данное
      сообщение появляется только в случае обращения к области памяти
      с помощью нулевого указателя
      Данная ошибка не будет вызывать останов программы; за сообщени-
      ем об ошибке следует нормальное завершение программы. Ошибка
      возвращает ненулевой код завершения. Данное сообщение отражает
      возможность серьезных ошибок в программе. Хотя программа, в ко-
      торой возникла такая ошибка, может работать правильно, она ве-
      роятно дает ошибки в будущем, и может дать сбой при работе в
      другой операционной среде.
R6002 "Библиотека процедур операций с плавающей точкой не загружена".
      Ваша программа требует библиотеку с плавающей точкой, но данная
      библиотека не загружена. Программа завершается по ошибке с ко-
      дом 255. Такая ошибка может произойти в следующих двух ситуа-
      циях:
      1.Программа была скомпилирована или скомпанована с такой опци-
      ей, как /FPi87, требующей сопроцессор 8087 или 80287, но прог-
      рамма выполняется на машине, не имеющей такого. Для исправления
      ошибки либо перекомпилируйте программу с опцией /FPi, либо ус-
      тановите сопроцессор. (В разделе 9.3.5 данного руководства вы
      найдете более подробную информацию о данных опциях и билиоте-
      ках.
      2.Строка формата для одной из процедур семейства printf или
      scanf содержит спецификацию для формата с плавающей точкой, в
      то время, как значений или переменных с плавающей точкой в про-
      грамме нет. Компилятор Quick-C делает попытку минимизировать
      размер программы посредством загрузки библиотеки поддержки пла-
      вающей точки только в случае крайней необходимости. Поскольку в
      форматных строках не обнаружено спецификаций плавающей точки,
      необходимые процедуры для работы с плавающей точкой не были за-
      гружены. Для исправления данной ошибки используйте какой-либо
      аргумент с плавающей точкой для соответствия заданной специфи-
      кации формата. Это приведет к тому, что библиотека поддержки
      плавающей точки будет загружена.
R6003 "Целое, деленное на нуль".
      Была сделана попытка разделить целое число на нуль, что дало
      неопределенный результат. Программа завершается с кодом 255.
R6004 "Требуется версия DOS 2.0 или выше".
      Компилятор Quick-C не может работать на версиях операционной
      системы DOS младше 2.0.
R6005 "Не хватает памяти для exec".
      Ошибки с R6005 по R6007 происходят при сбое в процедурах, вызы-
      ваемых одной из библиотечных, когда операционная система DOS не
      может вернуть управление в родительский процесс. Данная ошибка
      показывает, что для загрузки вызываемой программы не хватает
      памяти.
R6006 "Неверный формат для exec".
      Файл, выполняемый одной из функций exec, не имеет формата, тре-
      буемого для выполняемого файла.
R6007 "Некорректная среда для exec".
      Во время вызова одной из функций exec, операционная система DOS
      обнаружила некорректность среды для детского процесса.
R6008 "Не хватает памяти для аргументов".
R6009 "Не хватает памяти для программной среды".
      Ошибки R6008 и R6009 могут произойти при старте программы, если
      для загрузки программы хватает памяти, но недостаточно места
      для вектора argv, либо вектора envp, либо для обоих. Чтобы
      избежать данной проблемы перепишите процедуры _setargv или
      _setenvp
R6012 "Некорректное обращение к ближнему указателю".
      В программе был использован нулевой ближний указатель.
      Данная ошибка может произойти только при включенном контроле на
      указатели (то есть, если программа была скомпилирована с опцией
      Pointer Check в диалоговой рамке Compile, опцией /Zr на команд-
      ной строке, либо при действующей прагме pointer_check).
R6015 "Неожидаемое прерывание".
      Программа не может выполняться, поскольку она содержит неожида-
      емые прерывания.
      Когда прерывания создаются в программе из программного списка,
      работающей в программной среде, Quick-C автоматически создает
      объектные файлы и передает компановщику. Объектные файлы, пере-
      данные компановщику, содержат прерывания , требуемые для про-
      граммной среды Quick-C. Однако, вы не сможете запускать програ-
      мму, полученную из данных объектных файлов, вне программной
      среды Quick-C.

D.3.3. Ограничения периода выполнения.

В таблице D.2 приведены ограничения, накладываемые на программы в период выполнения. Если ваша программа нарушает одно из данных ограничений, система выдает соответствующее сообщение об ошибке.

                                                 Таблица D.2.

              Программные ограничения периода выполнения.

Элемент данных   Описание                            Ограничения


Файлы            Максимальный размер файла           232-1 байт
                                                     (4 гигабайта)
                 Максимальное число одновременно от-  20
                 крытых файлов (потоков).
Командная строка Максимальное количество символов     128
                 (включая имя программы).
Таблица операци- Максимальный размер.                  32К
онной среды.

Примечание:

Пять стандартных потоков открываются автоматически (stdin, stdout, stderr, stdaux, stdprn), оставляя еще 15 потоков для нужд программы.


D.4. Сообщения об ошибках компановщика.

Данный раздел описывает сообщения об ошибках, генерируемые компановщиком LINK (Оверлейный компановщик фирмы Microsoft). При возникновении фатальной ошибки компановщик прерывает выполнение. Сообщения о фатальных ошибках имеют следующий формат:

место возникновения: fatal error L1xxx: текст сообщения Нефатальные ошибки выявляют проблемы в выполняемом файле. Компановщик LINK строит выполняемый файл. Нефатальные ошибки имеют следующий формат:

место возникновения: error L2xxx: текст сообщения

Предупреждения также обозначают возможные проблемы в выполняемом файле. Компановщик LINK строит выполняемый файл. Предупреждения имеют следующий формат:

место возникновения: warning L4xxx: текст сообщения

В данных сообщениях-место возникновения-это входной файл, в котором обнаружена ошибка, либо программа LINK, если входного файла нет. Если входной файл-это файл .OBJ или .LIB и известно имя модуля, имя модуля заключается в скобки, как показано в следующем примере:

SLIBC.LIB( file)
MAIN.OBJ(main.c)
TEXT.OBJ

Ошибки компановщика могут возникнуть, как при неявном его вызове с помощью команды QCL, так и при явном вызове с помощью команды LINK. Они могут также произойти и при компиляции программы, имеющей программный список, либо когда вы создаете на диске выполняемый файл в среде Quick-C. Если ошибка компановщика возникает в программной среде Quick-C, Quick-C высвечивает сообщение:

Error during link phase
No .EXE file produced
(Ошибка в процессе компановки
 Выполняемого файла не создается).

Для просмотра ошибок компановщика нажмите ENTER, либо отметьте «мышью» командную кнопку OK. Ошибки последнего прохода компановщика хранятся в файле с именем LINK.ERR. В следующем списке приведены ошибки, возникающие во время компановки объектных файлов с помощью Microsoft Overlay Linker, LINK.

Номер    Сообщение об ошибке компановщика


L1001 "'option': имя опции неясно".
      После индикатора опции (/) не появилось уникального имени оп-
      ции. Например, команда
        Link /N main;
      сгенерирует ошибку, поскольку программа LINK не может опреде-
      лить, какая из опций, начинающихся на букву "N" имеется в виду.
L1002 "'option': нераспознанное имя опции".
      За индикатором опции (/) появился нераспознанный символ, как в
      следующем примере:
         LINK /ABCDEF main;
L1004 "'option': неверное числовое значение".
      Для одной из опций было задано некорректное числовое значение.
      Например, для опции, требующей числовое значение, задана сим-
      вольная строка.
L1006 "'option': размер стэка превышает 65535 байтов".
      Размер, определенный для стэка, превышает 65535 байтов.
l1007 "'option': номер прерывания превышает 255".
      В качестве значения опции /OVERLAYINTERRUPT задано число, более
      255.
l1008 "'option': слишком большое предельное число сегментов".
      Было установлено предельное число сегментов, большее 3072 ( с
      помощью опции /SEGMENTS).
L1009 "'option': CPARMAXALLOC: некорректное значение".
      Число, определенное в опции /CPARMAXALLOC не лежит в пределах
      1-65535.
L1020 "Не заданы объектные модули".
      Для компановщика не заданы имена объектных файлов.
L1021 "Файлы соответствий вкладывать невозможно".
      Один файл соответствий оказался внутри другого файла соответст-
      вий.
L1022 "Файл соответствий слишком длинный".
      Строка в файле соответствий длиннее 127 символов.
L1023 "Выполнение прекращено пользователем".
      Вы нажали CONTROL+C.
L1024 "Вложение правых скобок".
      В командной строке содержимое оверлея было написано некоррекн-
      но.
L1025 "Вложение левых скобок".
      В командной строке содержимое оверлея было написано некоррекн-
      но.
L1026 "Несоответствие правых скобок".
      В командной строке в спецификации содержимого оверлея пропуще-
      на правая скобка.
L1027 "Несоответствие левых скобок".
      В командной строке в спецификации содержимого оверлея пропуще-
      на левая скобка.
L1043 "Таблица распределения памяти переполнена".
      В программе задано более 32768 длинных вызовов, длинных перехо-
      дов, либо других длинных указателей.
      Попытайтесь заменить длинные ссылки короткими, если возможно, и
      перестроить объектный модуль
L1045 "Слишком много записей TYPDEF.
      Объектный модуль содержит более 255 записей TYPDEF. Данные за-
      писи описывают общие переменные. Такая ошибка может возникнуть
      только в программах, созданных компилятором Microsoft Quick-C
      или другими компиляторами, поддерживающими общие переменные.
      (TYPDEF-это термин операционной системы DOS. Он разъясняется в
      документе "Справочное руководство программиста по операционной
      системе MS-DOS фирмы Microsoft" или других справочных книг по
      DOS.)
L1046 "Слишком много внешних имен в одном модуле".
      В объектном модуле определено более 1023 внешних имен. Разбейте
      модуль на меньшие части.
L1047 "Слишком много имен групп, сегментов, классов в одном модуле".
      Программа содержит слишком много имен групп, сегментов, клас-
      сов. Сократите число групп, сегментов или классов и перестройте
      объектный файл.
L1048 "Слишком много сегментов в одном модуле".
      Объектный модуль имеет более 255 сегментов. Расщепите модуль
      или объедините сегменты.
L1049 "Слишком много сегментов".
      Программа имеет более, чем максимально разрешенное число сег-
      ментов. (опция /SEGMENTS определяет максимально разрешенное
      число; стандартно 128).
      Повторите компановку с опцией /SEGMENTS с соответствующим чис-
      лом сегментов.
L1050 "Слишком много групп в одном модуле".
      Программа LINK обнаружила более 21 определения групп (GRPDEF) в
      одном модуле.
      Сократите число определений групп или расщепите модуль. (Опре-
      деления групп разъясняются в документе "Справочное руководство
      программиста по MS-DOS" и в других справочных книгах по DOS.
L1051 "Слишком много групп".
      В программе определено более 20 групп, не считая DGROUP.
      Сократите количество групп.
L1052 "Слишком много библиотек".
      Была сделана попытка скомпановать более 32 библиотек.
      Объедините библиотеки, либо используйте модули, требующие мень-
      шего количества библиотек.
L1053 "Переполнение таблицы имен".
      Компановщик не имеет достаточно места для размещения таблицы
      имен программы (таких, как глобальные, внешние, имена сегмен-
      тов, групп, классов, файлов).
      Объедините модули или сегменты и перестройте объектные файлы.
      Исключите столько глобальных имен, сколько возможно.
L1054 "Требуемое количество сегментов слишком велико".
      Компановщик не имеет достаточно памяти для размещения таблицы,
      описывающей количество требуемых сегментов (стандартное число
      128 или значение, определенное в опции /SEGMENTS). Повторите
      компановку снова, используя опцию /SEGMENTS для задания меньше-
      го количества сегментов (например, 64, если ранее было исполь-
      зовано стандартное значение), либо освободите некоторое коли-
      чество памяти путем удаления резидентных программ или паралле-
      льных задач.
L1056 "Слишком много оверлеев".
      В программе определно более 63 оверлеев.
L1057 "Запись данных слишком велика".
      Запись LIDATA (в объектном модуле) содержит более 1024 байтов
      данных. Это ошибка транслятора. (LIDATA-это термин операционной
      системы DOS, его объяснение можно найти в документе "Справочное
      руководство программиста по MS-DOS фирмы Microsoft" или в дру-
      гих справочных книгах по DOS.
      Обратите внимание, какой транслятор (компилятор или ассемблер)
      построил некорректный объектный модуль и при каких обстоятель-
      ствах. Пожалуйста, сообщите о данной ошибке, используя форму
      Product Assistance Request, находящуюся в конце данного руко-
      водства.
L1070 "'name': размер сегмента превышает 64К".
      Заданный сегмент содержит более 64К кода или данных.
      Повторите компиляцию и компановку в большой модели памяти.
L1071 "Сегмент _TEXT больше 65520 байтов".
      Данная ошибка вероятнее всего может случиться только в СИ-прог-
      раммах малой модели памяти, однако она может произойти и, если
      любая программа с сегментом, названным _TEXT, компануется пос-
      редством команды LINK с опцией /DOSSEG. Программы на языке СИ
      малой модели памяти должны резервировать адреса кода 0 и 1; для
      целей выравнивания этот предел увеличивается до 16.
L1072 "Общая область больше 65536 байтов".
      Программа имеет более 64 общих переменных. Данная ошибка не мо-
      жет возникнуть в объектных файлах, сгенерированных с помощью
      Макроассемблера MASM (Microsoft Macro Assembler). Она возникает
      только в программах, полученных с помощью компилятороа, поддер-
      живающих общие переменные.
L1080 "Невозможно открыть файл-листинг".
      Диск или корневой каталог переполнены. Удалите или переместите
      файлы, чтобы освободить место.
L1081 "Переполнение при записи выполняемого файла".
      Диск, на который записывается выполняемый файл .EXE, переполнен
      Освободите место на диске и повторите компановку.
L1083 "Невозможно открыть выполняемый файл".
      Диск или корневой каталог переполнены. Удалите или переместите
      файлы, чтобы освободить место.
L1084 "Невозможно создать временный файл".
      Диск или корневой каталог переполнены. Освободите место на
      диске и повторите компановку.
L1085 "Невозможно открыть временный файл".
      Диск или корневой каталог переполнены. Удалите или переместите
      файлы, чтобы освободить место.
L1086 "Не хватает временного файла".
      Заметьте обстоятельства возникновения данной ситуации и свяжи-
      тесь с фирмой Microsoft Corporation, воспользовавшись формой
      "Product Assitance Request", находящейся в конце данного руко-
      водства.
L1087 "Неожиданный конец временного файла".
      Диск с временным выходным файлом компановщика удален.
L1088 "Переполнение при записи файла-листинга".
      При записи на диск файла-листинга диск переполнился. Освободите
      место на диске и повторите компановку.
L1089 "'filename': невозможно открыть файл соответствий".
      Программа LINK не может найти заданный файл соответствий. Обыч-
      но, это опечатка при задании имени файла.
L1090 "Повторно открыть файл-листинг невозможно"
      По запросу оригинальный диск не был заменен. Повторите компа-
      новку.
L1091 "Неожиданный конец файла в библиотеке".
      Диск, содержащий библиотеку, был вероятно, удален. Установите
      диск, содержащий библиотеку и повторите компановку.
L1093 "'filename':объектный файл не найден".
      Компановщик не может найти заданного объектного файла. Задайте
      правильное имя объектного файла и повторите компановку.
L1101 "Некорректный объектный модуль".
      Один из объектных модулей является некорректным. Если данная
      ошибка произошла после перекомпиляции, пожалуйста, свяжитесь с
      фирмой Microsoft Corporation, воспользовавшись формой "Product
      Assitance Request", приложенной в конце данного руководства.
L1102 "Неожиданный конец файла".
      Для библиотеки был обнаружен некорректный формат.
L1103 "Попытка обращения к данным, лежащим за границами сегмента".
      Заданная запись в объектном модуле продолжена за границы сег-
      мента. Это ошибка транслятора. Заметьте, какой транслятор (ком-
      пилятор или ассемблер) создал некорректный объектный модуль, и
      обстоятельства, в которых он был создан. Пожалуйста, сообщите
      о данной ситуации в фирму Microsoft Corporation, воспользовав-
      шись формой "Product Assistance Request", находящейся в конце
      данного руководства.
L1104 "'filename': некорректная библиотека".
      Заданный файл не является корректным библиотечным файлом. Дан-
      ная ошибка прекращает работу программы LINK.
L1113 "Неразрешенная COMDEF; системная ошибка".
      Заметьте обстоятельства возникновения данного сбоя и свяжитесь
      с фирмой Microsoft Corporation, воспользовавшись формой Product
      Assistance Request, находящейся в конце данного руководства.
L1114 "Файл не подходит для /EXEPACK; повторите компановку без опции
      /EXEPACK".
      В компануемой программе размер упакованного загружаемого обра-
      за плюс заголовок больше, чем неупакованный загружаемый образ.
      Повторите компановку с помощью опции /EXEPACK.
L2001 "Запись fixup без данных".
      Запись FIXUPP не имеет непосредственно предшествующей записи
      данных. Вероятно, это ошибка компилятора. (Подробности о
      FIXUPP смотрите в документе "Справочное руководство программис-
      та по MS-DOS фирмы Microsoft").
L2002 "Переполнение записи fixup при "ближнем" вызове 'number'
      frame seg 'segname'
      target seg 'segname'
      target offset 'number'"
      Данную ошибку могут вызвать следующие условия:
      -Программа компилируется в малой модели памяти с опцией /NT.
      -Группа больше 64К.
      -Программа содержит междусегментные короткие переходы или меж-
       дусегментные короткие вызовы.
      -Имя элемента данных в программе не соответствует процедуре из
       библиотеки процедур, подключенной к компановке.
      -Объявление EXTRN в исходном файле на яхыке ассемблер появилось
       в теле сегмента, как в следующем примере:
      code    SEGMENT public 'CODE'
              EXTRN   main:far
      start   PROC    far
              call    main
              ret
      start   ENDP
      code    ENDS
      Предпочтительна следующая конструкция:
              EXTRN   main:far
      code    SEGMENT public 'CODE'
      start   PROC    far
              call    main
      start   ENDP
      code    ENDS
      Перепишите исходный файл и перестройте объектный файл. (Подроб-
      ную информация о frame segment и target segment вы найдете в
      документе "Справочное руководство программиста по MS-DOS фирмы
      Microsoft".)
L2003 "Дальний вызов на данные собственного сегмента".
      Дальние вызовы на данные собственного сегмента не разрешаются.
L2005 "Тип fixup не поддерживается".
      Оказалось, что тип fixup не поддерживается компановщиком фирмы
      Microsoft. Вероятно, это ошибка компилятора. Обратите внимание

      на обстоятельства данной ошибки и сообщите их в фирму Microsoft
      Corporation, воспользовавшись формой "Product Assistance
      Request", находящейся в конце данного руководства.
L2012 "'name': несоответствие размера элемента массива".
      "Дальний" общий массив был описан с двумя или более различны-
      ми размерами элементов массива (например, первый раз массив был
      описан, как массив символов, а второй раз, как массив дейст-
      вительных чисел).
L2013 "Запись LIDATA слишком велика".
      Запись LIDATA в объектном модуле имеет размер более 512 байтов,
      максимально разрешенного размера. Это ошибка компилятора. По-
      жалуйста, сообщите об условиях возникновения данной ошибки в
      фирму Microsoft, воспользовавшись формой "Product Assistance
      Request" в конце данного руководства.
L2024 "'name': имя уже определено".
      Одно из специальных оверлейных имен, требуемое для поддержки
      оверлеев, было определено в объектном файле.
L2025 "'name': имя определено более одного раза".
      Удалите из объектного файла лишние определения имен.
L2029 "Неразрешенные внешние ссылки".
      В одном или более модулей одно или более имен описаны, как
      внешние, но они не были определены, как публичные ни в одном из
      модулей или библиотек. После сообщения появляется список нераз-
      решенных внешних ссылок, как показано в следующем примере:
      EXIT in file(s):
       MAIN.OBJ (main.for)
      OPEN in file(s):
       MAIN.OBJ (main.for)
      Имя, которое идет перед 'in file(s)'-это неразрешенное внешнее
      имя. На следующей строке-список объектных модулей, имеющих ссы-
      лки на данное имя. Это сообщение и список записываются также в
      файл карты распределения памяти, если он существует.
L2041 "Стэк плюс данные превышает 64К".
      Общий размер стэкового сегмента программы плюс DGROUP превышает
      64К; в результате, программа загружается неверно.
L2043 "Стартовый адрес__ aulstart не найден".
      Если вы строите библиотеку Quick с использованием опции /Q,
      компановщик требует имя __aulstart, определенное, как стар-
      товый адрес.
L4003 "Неразрешенный вызов: смещение offset".
      Данная ошибка может быть вызвана компиляцией программы в малой
      модели памяти с опцией /NT.
L4012 "Опция /HIGH отменяет /EXEPACK".
      Опции /HIGH и /EXEPACK не могут быть использованы одновременно.
L4015 "Опция /CODEVIEW отменяет /DSALLOCATE".
      Опции /CODEVIEW и /DSALLOCATE не могут быть использованы одно-
      временно.
L4016 "Опция /CODEVIEW отменяет /EXEPACK".
      Опции /CODEVIEW и /EXEPACK не могут быть использованы одно-
      временно.
L4020 "'name': размер сегмента кода превышает 65500".
      Сегмент кода размером 65501-65536 байтов в длину может на про-
      цессоре Intel 80286 быть обработан некорректно.
L4021 "Нет стэкового сегмента".
      Программа не имеет стэкового сегмента, определенного с типом
      STACK. Данное сообщение не возникнет при обработке модулей,
      скомпилированных с помощью компилятора Microsoft Quick-C, но не
      с помощью Макроассемблера.
      Обычно, каждая программа должна иметь стэковый сегмент с типом
      объединения STACK. Если у вас есть особые причины не определять
      стэк или определить его без типа объединения STACK, вы можете
      проигнорировать данное сообщение. Данное сообщение может быть
      получено и при компановке с помощью LINK версий 2.40 и младше,
      поскольку данные компановщики просматривают библиотеки только
      один раз.
L4031 "'name': сегмент описан более, чем в одной группе".
      Сегмент был описан, как член двух различных групп. Исправьте
      исходный файл и перестройте объектные файлы.
L4034 "Более 239 оверлейных сегментов; лишние помещены в корень".
      В оверлеях не может быть объявлено более 239 кодовых сегментов.
      Все сегменты свыше данного предела помещаются в корень.
L4045 "Имя выходного файла 'name'".
      Компановщик высветил в запросе "Run file" стандартное выходное
      имя файла, но поскольку была использована опция /Q, имя выход-
      ного файла было изменено.
L4050 "Слишком много глобальных имен".
      Для получения отсортированного списка глобальных имен в файле
      распределения памяти была использована опция /MAP, но задано
      для сортировки слишком много имен (более 2048 имен по умолча-
      нию). Повторите компановку с опцией /MAP:number. Компановщик
      выдает неотсортированный список глобальных имен.
L4051 "'filename': невозможно найти библиотеку".
      Компановщик не может найти заданный файл. Введите новое имя,
      новую спецификацию маршрута, или и то, и другое.
L4053 "VM.TMP: некорректное имя файла; игнорируется".
      Имя VM.TMP появилось, как объектное имя файла. Переименуйте
      файл и повторите компановку.
L4054 "'filename': невозможно найти файл".
      Компановщик не может найти заданный файл. Введите новое имя
      файла, новую спецификацию маршрута, либо и то, и другое.

D.5.Сообщения об ошибках утилиты LIB.

Сообщения об ошибках, сгенерированные администратором библиотек, программой LIB, имеет один из следующих форматов:

    {filename|LIB}: fatal error U1xxx: текст сообщения

    {filename|LIB}: error U2xxx: текст сообщения

    {filename|LIB}: warning U4xxx: текст сообщения

Сообщение начинается именем входного файла (filename), если он существует, либо именем утилиты. Если возможно, программа LIB распечатывает предупреждение и продолжает работу. В некоторых случаях ошибки неисправимы и утилита LIB прекращает работу. Утилита LIB может высветить следующие сообщения:

Номер    Сообщения об ошибках утилиты LIB


U1150 "Размер страницы слишком мал".
      Размер страницы входной библиотеки слишком мал, что означает
      некорректный входной файл .LIB.
U1151 "Синтаксическая ошибка: неверная спецификация файла".
      Командный оператор, такой как знак минус(-) был задан без соот-
      ветствующего имени модуля.
U1152 "Синтаксическая ошибка: наименование опции опущено".
      Знак опции слэш (/) был задан без следующей за ним опции.
U1153 "Синтаксическая ошибка: значение опции пропущено".
      Опция /PAGESIZE была задана без соответствующего значения.
U1154 "Неизвестная опция".
      Была задана неизвествная опция. В данный момент программа LIB
      распознает только опции /PAGESIZE.
U1155 "Синтаксическая ошибка: некорректный ввод".
      Данная команда не следует правильному синтаксису утилиты LIB,
      описанному в Главе 10, "Создание библиотек Quick и автономных
      библиотек".
U1156 "Синтаксическая ошибка".
      Данная команда не следует правильному синтаксису утилиты LIB,
      описанному в Главе 10, "Создание библиотек Quick и автономных
      библиотек".
U1157 "Пропущена запятая или символ перехода на новую строку".
      В командной строке ожидалась запятая или возврат каретки, кото-
      рые не появились. Это может означать нечаянно поставленную
      запятую, как в следующей строке:
      LIB math.lib, -mod1+mod2;
      Эта строка должна иметь следующий вид:
      LIB math.lib -mod1+mod2;
U1158 "Пропущен возврат каретки".
      Либо ответ на запрос "Output library", либо последняя строка в
      файле соответствий, используемого для запуска программы LIB, не
      заканчивается возвратом каретки.
U1161 "Невозможно переименовать старую библиотеку".
      Программа LIB не может переименовать старую библиотеку с рас-
      ширением .BAK, поскольку версия .BAK уже существует с защитой
      "только-чтение". Измените защиту старой версии .BAK.
U1162 "Невозможно повторно открыть библиотеку".
      Старая библиотека не может быть повторно открыта после того,
      как она была переименована с расширением .BAK.
U1163 "Ошибка при записи файла перекрестных ссылок".
      Диск или корневая директория переполнены. Удалите или переком-
      пилируйте файлы, чтобы освободить место.
U1170 "Слишком много имен".
      В библиотечном файле появилось более 4609 имен.
U1171 "Не хватает памяти".
      Программе LIB не хватает памяти для работы. Удалите параллель-
      ные и резидентные программы и повторите попытку, либо увеличьте
      память.
U1172 "Не хватает виртуальной памяти".
      Заметьте обстоятельства данного сбоя и уведомите фирму
      Microsoft Corporation, воспользовавшись формой "Product
      Assistance Request", находящейся в конце данного руководства.
U1173 "Системный сбой".
      Обратите внимание на обстоятельства данного сбоя и уведомите
      фирму Microsoft Corporation, воспользовавшись формой "Product
      Assistance Request", находящейся в конце данного руководства.
U1174 "mark: не размещено".
      Заметьте обстоятельства данного сбоя и уведомите фирму
      Microsoft Corporation, воспользовавшись формой "Product
      Assistance Request", находящейся в конце данного руководства.
U1175 "free: не размещено".
      Заметьте обстоятельства данного сбоя и известите фирму
      Microsoft Corporation, воспользовавшись формой "Product
      Assistance Request", находящейся в конце данного руководства.
U1180 "Запись извлекаемого файла потерпела неудачу".
      Диск или корневой каталог переполнены. Удалите или перемес-
      тите файлы, чтобы освободить место.
U1181 "Запись в библиотечный файл потерпела неудачу".
      Диск или корневой каталог переполнены. Удалите или перемес-
      тите файлы, чтобы освободить место.
U1182 "'filename': невозможно создать извлекаемый файл".
      Диск или корневой каталог переполнены, либо заданный извлекае-
      мый файл уже существует с защитой "только-чтение".
      Освободите место на диске, либо измените вид защиты файла.
U1183 "Невозможно открыть файл соответствий".
      Данный файл соответствий не найден.
U1184 "Неожиданный конец файла при вводе команды".
      В ответе на запрос был обнаружен символ конца файла.
U1185 "Невозможно создать новую библиотеку".
      Диск или корневой каталог переполнены, либо библиотечный файл
      уже существует с защитой "только-чтение". Освободите место на
      диске или измените атрибуты защиты библиотечного файла.
U1186 "Ошибка при записи новой библиотеки".
      Диск или корневой каталог переполнены. Удалите или переместите
      файлы для освобождения места.
U1187 "Невозможно открыть VM.TMP".
      Диск или корневой каталог переполнены.
U1188 "Невозможно записать в VM".
      Отметьте обстоятельства возникновения данного сбоя и сообщите
      в фирму Microsoft Corporation, воспользовавшись бланком
      "Product Assistance Request", находящейся в конце данного руко-
      водства.
U1189 "Невозможно прочесть из VM".
      Обратите внимание на обстоятельства возникновения данной ошибки
      и сообщите в фирму Microsoft Corporation, воспользовавшись
      бланком "Product Assistance Request", находящейся в конце
      данного руководства.
U1190 "Прервано пользователем".
      Вы прервали работу программы LIB до завершения работы.
U1200 "'name': некорректный заголовок библиотеки".
      Входной библиотечный файл имеет неправильный формат. Он либо не
      является библиотечным файлом, либо разрушен.
U1203 "'name': некорректный объектный модуль по ближнему адресу".
      Модуль, заданный по имени 'name', является некорректным объект-
      ным модулем.
U2152 "'filename': невозможно создать листинг".
      Диск или каталог переполнены, либо файл перекрестных ссылок
      уже существует с защитой "только-чтение".
      Освободите место на диске, либо измените атрибуты файла.
U2155 "'modulename': модуль не найден в библиотеке; игнорируется".
      Заданный модуль не найден во входной библиотеке
U2157 "'filename': невозможно получить доступ к файлу".
      Программа LIB не могла открыть заданный файл.
U2158 "'libraryname': неверный заголовок библиотеки; файл игнориру-
      ется".
      Входная библиотека имеет некорректный формат.
U2159 "'filename': неверный формат 'hexnumber'; файл игнорируется".
      Опознавательный байт слова 'hexnumber' данного файла не имеет
      одного из следующих распознаваемых типов:
      библиотека Microsoft, библиотека Intel, объектный файл Micro-
      soft, архив XENIX.
U4150 "'modulname': переопределение модуля игнорируется".
      Модуль был определен для добавления в библиотеку, но модуль с
      тем де именем уже есть в библиотеке. Либо, модуль с одним и тем
      же именем помещен в библиотеку дважды.
U4151 "'symbol (modulename): переопределение имени игнорируется".
      Заданное имя определено более, чем в одном модуле.
U4153 "'number': размер страницы слишком мал; игнорируется".
      Значение, определенное в опции /PAGESIZE меньше 16.
U4156 "'libraryname': спецификация выходной библиотеки игнорируется".
      В дополнение к новому библиотечному имена была задана выходная
      библиотека.
      Например, задав:

    LIB new.lib+one.obj, new.lst,new.lib

    где new.lib еще не существует-вы получите ошибку.

D.6. Сообщения об ошибках утилиты MAKE.

Ошибки, высвечиваемые в процессе работы утилиты поддержки программ Microsoft (MAKE) имеют один из следующих форматов:

    {filename|MAKE}: fatal error U1xxx: текст сообщения

    {filename|MAKE}: warning U4xxx: текст сообщения

Сообщения начинаются с имени входного файла (filename), если он существует, либо с имени утилиты. Если возможно, утилита MAKE печатает предупреждение и продолжает работу. В некоторых случаях ошибки являются неисправимыми и утилита MAKE прекращает работу. Сообщения, генерируемые утилитой MAKE, перечислены в данном разделе.

Номер  Сообщения об ошибках утилиты MAKE


U1001 "Макроопределение больше, чем number".
      Было определено макро, имеющее значение строки, длинее установ-
      ленного числа, разрешающего максимальную длину. Попытайтесь пе-
      реписать файл описанний утилиты MAKE и расщепить макро на два
      меньших.
U1002 "Бесконечно рекурсивное макро".
      Был определен циклический вызов макрокоманд, как в следующем
      примере:
      A=$(B)
      B=$(C)
      C=$(A)
U1003 "Выход за пределы памяти".
      Во время обработки файла описаний утилита MAKE вышла за пределы
      памяти. Попытайтесь сократить размер файла описаний утилиты
      MAKE путем его реорганизации или расщепления на меньшие.
U1004 "Синтаксическая ошибка: пропущено имя макрокоманды".
      Файл описаний утилиты MAKE содержит макроопределение без левой
      части (то есть строки, начинающейся с =).
U1005 "Синтаксическая ошибка: пропущено двоеточие".
      В строке, которая должна содержать выходной файл/входной файл,
      не хватает двоеточия, разделяющего выходной файл и входной
      файл. Утилита MAKE требует любую строку, за которой следует
      пустая строка, чтобы считать ее строкой выходного/входного фай-
      ла.
U1006 "'targetname': макрорасширение больше числа 'number'".
      Макрорасширение плюс длина любой строки, с которой оно может
      быть объединено, длинее установленного числа. Попытайтесь пере-
      записать файл описаний утилиты MAKE, расшепив макро на два ме-
      ньших.
U1007 "Много источников".
      Правило вывода были определено более одного раза.
U1008 "'name': невозможно найти файл или каталог".
      Заданные файл или каталог не могут быть найдены.
U1009 "'command': список аргументов слишком длинный".
      Командная строка в файле описаний утилиты MAKE длиннее 128 бай-
      тов, что максимально разрешено в DOS. Перепишите команды, чтобы
      сделать список аргументов короче.
U1010 "'filename': отказ доступа".
      Файл, определенный, как 'filename'-имеет атрибут "только-чте-
      ние.
U1011 "'filename': не хватает памяти".
      Для выполнения программы утилите MAKE не хватает памяти.
U1012 "'filename': неизвестная ошибка".
      Заметьте обстоятельства возникновения данной ошибки и сообщите
      о них фирме Microsoft Corporation, воспользовавшись бланком
      "Product Assistance Request", данным в конце данного руко-
      водства.
U1013"'command': ошибка errcode".
      Одна из программ или команд, вызванная в файле описаний утилиты
      MAKE, завершилась с ненулевым кодом завершения.
U1015 "'file': целевой файл не существует".
      Обычно, это не означает ошибку. Данное сообщение предупреждает
      пользователя о том, что целевой файл не существует. Утилита
      MAKE выполняет любые команды, заданные в блоке описаний, поско-
      льку в большинстве случаев выходной файл создается последней
      командой файла описаний утилиты MAKE.
U4000 "'filename': не существует".
      Обычно, это сообщение не свидетельствует об ошибке. Оно пре-
      дупреждает пользователя о том, что указанный файл не существует
      MAKE выполняет все команды, заданные в блоке, так как в боль-
      шистве случаев отсутствующий файл будет создан последующими
      командами файла MAKE.
U4001 "Зависимый файл 'filename' не существует; целевой файл 'filena
      me' не строится".
      Утилита MAKE не может продолжать, поскольку требуемый входной
      файл не существует. Удостоверьтесь, что все имена файлов при-
      сутствуют и что все они корректно описываются в файле описаний
      утилиты MAKE.
U4013 "'command': ошибка errcode (игнорируется)".
      Одна из программ или команд, вызванных в файле описаний утилиты
      MAKE, возвратила ненулевой код ошибки, в то время, как утилита
      MAKE работала с опцией /I. Ошибки игнорируются и утилита про-
      должает работу.
U4014 "Синтаксис: make options [name-value...] file options=[/n]
      [/d][/i][/s][/x file]
      Утилита MAKE была неправильно вызвана. Стартуйте утилиту зано-
      во, воспользовавшись синтаксисом, представленным в сообщении:
      make опции[имя-значение...] file опции=[/n][/d][/i][/s]
      [/x file].

Понравилась статья? Поделить с друзьями:
  • Ошибка компиляции microsoft vbscript 800a0408
  • Ошибка компиляции java
  • Ошибка компиляции фильма adobe premiere код ошибки 1609629690
  • Ошибка компилятора cs5001
  • Ошибка компиляции фильма adobe premiere pro код ошибки 3